Uploaded image for project: 'JDK'
  1. JDK
  2. JDK-8262080

vmTestbase/nsk/jdi/Event/request/request001/TestDescription.java failed with "ERROR: new event is not ThreadStartEvent"

    XMLWordPrintable

    Details

    • Subcomponent:
    • Resolved In Build:
      b15
    • CPU:
      x86_64
    • OS:
      linux

      Description

      The following test failed in the JDK17 CI:

      vmTestbase/nsk/jdi/Event/request/request001/TestDescription.java

      Here's a snippet from the log file:

      --> debugger: ......waiting for ThreadStartEvent
      # ERROR: ##> debugger: ERROR: new event is not ThreadStartEvent: ThreadDeathEvent in thread UsageTracker
      The following stacktrace is for failure analysis.
      nsk.share.TestFailure: ##> debugger: ERROR: new event is not ThreadStartEvent: ThreadDeathEvent in thread UsageTracker
      at nsk.share.Log.logExceptionForFailureAnalysis(Log.java:432)
      at nsk.share.Log.complain(Log.java:403)
      at nsk.share.jdi.JDIBase.log3(JDIBase.java:67)
      at nsk.jdi.Event.request.request001.testRun(request001.java:364)
      at nsk.jdi.Event.request.request001.runTest(request001.java:244)
      at nsk.jdi.Event.request.request001.runThis(request001.java:180)
      at nsk.jdi.Event.request.request001.run(request001.java:109)
      at nsk.jdi.Event.request.request001.main(request001.java:102)
      at java.base/jdk.internal.reflect.NativeMethodAccessorImpl.invoke0(Native Method)
      at java.base/jdk.internal.reflect.NativeMethodAccessorImpl.invoke(NativeMethodAccessorImpl.java:78)
      at java.base/jdk.internal.reflect.DelegatingMethodAccessorImpl.invoke(DelegatingMethodAccessorImpl.java:43)
      at java.base/java.lang.reflect.Method.invoke(Method.java:566)
      at com.sun.javatest.regtest.agent.MainWrapper$MainThread.run(MainWrapper.java:127)
      at java.base/java.lang.Thread.run(Thread.java:831)
      --> debugger: waiting for VMDeathEvent
      # ERROR: ##> debugger: ERROR: Exception : nsk.share.jdi.JDITestRuntimeException: JDITestRuntimeException : ** EXCEPTION while waiting for event ** : nsk.share.jdi.JDITestRuntimeException: JDITestRuntimeException : ** TIMEOUT while waiting for event **
      # ERROR: ##> debugger: test phase has not finished normally: debuggee is still alive
      --> debugger: ......forcing: vm.exit();
      TEST FAILED
      # ERROR: binder> Debugee VM has not exited correctly: trying to kill it
      The following stacktrace is for failure analysis.
      nsk.share.TestFailure: binder> Debugee VM has not exited correctly: trying to kill it
      at nsk.share.Log.logExceptionForFailureAnalysis(Log.java:432)
      at nsk.share.Log.complain(Log.java:403)
      at nsk.share.jpda.DebugeeProcess.complain(DebugeeProcess.java:417)
      at nsk.share.jpda.DebugeeProcess.close(DebugeeProcess.java:397)
      at nsk.share.jpda.DebugeeProcess.finalize(DebugeeProcess.java:426)
      at nsk.share.FinalizableObject.finalizeAtExit(FinalizableObject.java:48)
      at nsk.share.Finalizer$FinalizerThread.run(Finalizer.java:122)

        Attachments

          Issue Links

            Activity

              People

              Assignee:
              amenkov Alex Menkov
              Reporter:
              dcubed Daniel Daugherty
              Votes:
              0 Vote for this issue
              Watchers:
              5 Start watching this issue

                Dates

                Created:
                Updated:
                Resolved: