Uploaded image for project: 'JDK'
  1. JDK
  2. JDK-8263466

tools/jpackage tests fail with "double free or corruption"

    XMLWordPrintable

    Details

    • Subcomponent:
    • CPU:
      x86_64
    • OS:
      linux

      Description

      The following test fails in the JDK17 CI (with UT enabled):

      tools/jpackage/linux/jdk/jpackage/tests/UsrTreeTest.java

      Here's a snippet from the log file:

      [03:43:47.676] [ PASSED ] 3 tests
      [03:43:47.687] [ FAILED ] 1 test, listed below
      [03:43:47.688] [ FAILED ] UsrTreeTest.testUsrCustom2; workDir=[./testUsrCustom2]
      [03:43:47.689] 1 FAILED TEST
      ----------System.err:(265/27799)----------
      *** Error in `/opt/mach5/mesos/work_dir/slaves/28992c6d-c35d-42fa-8099-898223bf183b-S25565/frameworks/1735e8a2-a1db-478c-8104-60c8b0af87dd-0196/executors/eb111d30-729c-491b-ae4c-8ffe84ea5d2a/runs/b5bfaf83-646d-4d87-9a47-7980925df9ea/testoutput/test-support/jtreg_open_test_jdk_tier2_part2/scratch/0/./testUsrCustom2/unpacked-rpm/usrbuz/usrcustom2usrtreetest/bin/UsrCustom2UsrTreeTest': double free or corruption (out): 0x00007fcd682a3980 ***
      ======= Backtrace: =========
      /lib64/libc.so.6(+0x81329)[0x7fcd6eb73329]
      /lib64/libdl.so.2(+0x15d5)[0x7fcd6eec15d5]
      /lib64/libdl.so.2(dlsym+0x48)[0x7fcd6eec1118]
      /opt/mach5/mesos/work_dir/slaves/28992c6d-c35d-42fa-8099-898223bf183b-S25565/frameworks/1735e8a2-a1db-478c-8104-60c8b0af87dd-0196/executors/eb111d30-729c-491b-ae4c-8ffe84ea5d2a/runs/b5bfaf83-646d-4d87-9a47-7980925df9ea/testoutput/test-support/jtreg_open_test_jdk_tier2_part2/scratch/0/testUsrCustom2/unpacked-rpm/usrbuz/usrcustom2usrtreetest/lib/runtime/lib/server/libjvm.so(JVM_FindLibraryEntry+0x2d)[0x7fcd6dd45bfd]
      /opt/mach5/mesos/work_dir/slaves/28992c6d-c35d-42fa-8099-898223bf183b-S25565/frameworks/1735e8a2-a1db-478c-8104-60c8b0af87dd-0196/executors/eb111d30-729c-491b-ae4c-8ffe84ea5d2a/runs/b5bfaf83-646d-4d87-9a47-7980925df9ea/testoutput/test-support/jtreg_open_test_jdk_tier2_part2/scratch/0/testUsrCustom2/unpacked-rpm/usrbuz/usrcustom2usrtreetest/lib/runtime/lib/libjava.so(+0xea8a)[0x7fcd6f189a8a]
      /opt/mach5/mesos/work_dir/slaves/28992c6d-c35d-42fa-8099-898223bf183b-S25565/frameworks/1735e8a2-a1db-478c-8104-60c8b0af87dd-0196/executors/eb111d30-729c-491b-ae4c-8ffe84ea5d2a/runs/b5bfaf83-646d-4d87-9a47-7980925df9ea/testoutput/test-support/jtreg_open_test_jdk_tier2_part2/scratch/0/testUsrCustom2/unpacked-rpm/usrbuz/usrcustom2usrtreetest/lib/runtime/lib/libjava.so(Java_jdk_internal_loader_NativeLibraries_findBuiltinLib+0xa9)[0x7fcd6f18a199]
      [0x7fcd5320d87a]
      ======= Memory map: ========
      60e800000-62dc00000 rw-p 00000000 00:00 0
      62dc00000-800010000 ---p 00000000 00:00 0
      800010000-800040000 rw-p 00000000 00:00 0
      800040000-800080000 rw-p 00000000 00:00 0
      800080000-840000000 ---p 00000000 00:00 0
      55b960e31000-55b960e33000 r-xp 00000000 08:03 945363073 /opt/mach5/mesos/work_dir/slaves/28992c6d-c35d-42fa-8099-898223bf183b-S25565/frameworks/1735e8a2-a1db-478c-8104-60c8b0af87dd-0196/executors/eb111d30-729c-491b-ae4c-8ffe84ea5d2a/runs/b5bfaf83-646d-4d87-9a47-7980925df9ea/testoutput/test-support/jtreg_open_test_jdk_tier2_part2/scratch/0/testUsrCustom2/unpacked-rpm/usrbuz/usrcustom2usrtreetest/bin/UsrCustom2UsrTreeTest
      55b960e34000-55b960e35000 r--p 00002000 08:03 945363073 /opt/mach5/mesos/work_dir/slaves/28992c6d-c35d-42fa-8099-898223bf183b-S25565/frameworks/1735e8a2-a1db-478c-8104-60c8b0af87dd-0196/executors/eb111d30-729c-491b-ae4c-8ffe84ea5d2a/runs/b5bfaf83-646d-4d87-9a47-7980925df9ea/testoutput/test-support/jtreg_open_test_jdk_tier2_part2/scratch/0/testUsrCustom2/unpacked-rpm/usrbuz/usrcustom2usrtreetest/bin/UsrCustom2UsrTreeTest
      55b960e35000-55b960e36000 rw-p 00003000 08:03 945363073 /opt/mach5/mesos/work_dir/slaves/28992c6d-c35d-42fa-8099-898223bf183b-S25565/frameworks/1735e8a2-a1db-478c-8104-60c8b0af87dd-0196/executors/eb111d30-729c-491b-ae4c-8ffe84ea5d2a/runs/b5bfaf83-646d-4d87-9a47-7980925df9ea/testoutput/test-support/jtreg_open_test_jdk_tier2_part2/scratch/0/testUsrCustom2/unpacked-rpm/usrbuz/usrcustom2usrtreetest/bin/UsrCustom2UsrTreeTest
      55b961c79000-55b961cc3000 rw-p 00000000 00:00 0 [heap]
      7fccf4000000-7fccf4021000 rw-p 00000000 00:00 0
      7fccf4021000-7fccf8000000 ---p 00000000 00:00 0
      7fccf8000000-7fccf8021000 rw-p 00000000 00:00 0
      7fccf8021000-7fccfc000000 ---p 00000000 00:00 0
      7fccfc000000-7fccfc021000 rw-p 00000000 00:00 0
      7fccfc021000-7fcd00000000 ---p 00000000 00:00 0
      7fcd00000000-7fcd00021000 rw-p 00000000 00:00 0
      7fcd00021000-7fcd04000000 ---p 00000000 00:00 0
      7fcd04000000-7fcd0403e000 rw-p 00000000 00:00 0
      7fcd0403e000-7fcd08000000 ---p 00000000 00:00 0
      7fcd08000000-7fcd08021000 rw-p 00000000 00:00 0
      7fcd08021000-7fcd0c000000 ---p 00000000 00:00 0
      7fcd0c000000-7fcd0c021000 rw-p 00000000 00:00 0
      7fcd0c021000-7fcd10000000 ---p 00000000 00:00 0
      7fcd10000000-7fcd10086000 rw-p 00000000 00:00 0
      7fcd10086000-7fcd14000000 ---p 00000000 00:00 0
      7fcd14000000-7fcd14021000 rw-p 00000000 00:00 0
      7fcd14021000-7fcd18000000 ---p 00000000 00:00 0
      7fcd18000000-7fcd18021000 rw-p 00000000 00:00 0
      7fcd18021000-7fcd1c000000 ---p 00000000 00:00 0
      7fcd1c000000-7fcd1c021000 rw-p 00000000 00:00 0
      7fcd1c021000-7fcd20000000 ---p 00000000 00:00 0
      7fcd20000000-7fcd20021000 rw-p 00000000 00:00 0
      7fcd20021000-7fcd24000000 ---p 00000000 00:00 0
      7fcd24000000-7fcd24021000 rw-p 00000000 00:00 0
      7fcd24021000-7fcd28000000 ---p 00000000 00:00 0
      7fcd28000000-7fcd28021000 rw-p 00000000 00:00 0
      7fcd28021000-7fcd2c000000 ---p 00000000 00:00 0
      7fcd2c000000-7fcd2c021000 rw-p 00000000 00:00 0
      7fcd2c021000-7fcd30000000 ---p 00000000 00:00 0
      7fcd307df000-7fcd307f4000 r-xp 00000000 08:03 237 /usr/lib64/libgcc_s-4.8.5-20150702.so.1
      7fcd307f4000-7fcd309f3000 ---p 00015000 08:03 237 /usr/lib64/libgcc_s-4.8.5-20150702.so.1
      7fcd309f3000-7fcd309f4000 r--p 00014000 08:03 237 /usr/lib64/libgcc_s-4.8.5-20150702.so.1
      7fcd309f4000-7fcd309f5000 rw-p 00015000 08:03 237 /usr/lib64/libgcc_s-4.8.5-20150702.so.1
      7fcd309f5000-7fcd309f6000 ---p 00000000 00:00 0
      7fcd309f6000-7fcd30af7000 rw-p 00000000 00:00 0
      7fcd30af7000-7fcd30afb000 ---p 00000000 00:00 0
      7fcd30afb000-7fcd30bf8000 rw-p 00000000 00:00 0
      7fcd30bf8000-7fcd30bfc000 ---p 00000000 00:00 0
      7fcd30bfc000-7fcd30cf9000 rw-p 00000000 00:00 0
      7fcd30cf9000-7fcd30cfd000 ---p 00000000 00:00 0
      7fcd30cfd000-7fcd30dfa000 rw-p 00000000 00:00 0
      7fcd30dfa000-7fcd30dfe000 ---p 00000000 00:00 0
      7fcd30dfe000-7fcd30efb000 rw-p 00000000 00:00 0
      7fcd30efb000-7fcd30eff000 ---p 00000000 00:00 0
      7fcd30eff000-7fcd30ffc000 rw-p 00000000 00:00 0
      7fcd30ffc000-7fcd31000000 ---p 00000000 00:00 0
      7fcd31000000-7fcd310fd000 rw-p 00000000 00:00 0
      7fcd310fd000-7fcd31101000 ---p 00000000 00:00 0
      7fcd31101000-7fcd311fe000 rw-p 00000000 00:00 0
      7fcd311fe000-7fcd31202000 ---p 00000000 00:00 0
      7fcd31202000-7fcd312ff000 rw-p 00000000 00:00 0
      7fcd312ff000-7fcd31303000 ---p 00000000 00:00 0
      7fcd31303000-7fcd317e0000 rw-p 00000000 00:00 0
      7fcd317e0000-7fcd31c00000 ---p 00000000 00:00 0
      7fcd31c4a000-7fcd31c7b000 rw-p 00000000 00:00 0
      7fcd31c7b000-7fcd31c7f000 ---p 00000000 00:00 0
      7fcd31c7f000-7fcd31d7c000 rw-p 00000000 00:00 0
      7fcd31d7c000-7fcd31d80000 ---p 00000000 00:00 0
      7fcd31d80000-7fcd31e7d000 rw-p 00000000 00:00 0
      7fcd31e7d000-7fcd31e7e000 ---p 00000000 00:00 0
      7fcd31e7e000-7fcd34000000 rw-p 00000000 00:00 0
      7fcd34000000-7fcd34021000 rw-p 00000000 00:00 0
      7fcd34021000-7fcd38000000 ---p 00000000 00:00 0
      7fcd38000000-7fcd38021000 rw-p 00000000 00:00 0
      7fcd38021000-7fcd3c000000 ---p 00000000 00:00 0
      7fcd3c000000-7fcd3c021000 rw-p 00000000 00:00 0
      7fcd3c021000-7fcd40000000 ---p 00000000 00:00 0
      7fcd4001e000-7fcd40033000 r-xp 00000000 08:03 945362888 /opt/mach5/mesos/work_dir/slaves/28992c6d-c35d-42fa-8099-898223bf183b-S25565/frameworks/1735e8a2-a1db-478c-8104-60c8b0af87dd-0196/executors/eb111d30-729c-491b-ae4c-8ffe84ea5d2a/runs/b5bfaf83-646d-4d87-9a47-7980925df9ea/testoutput/test-support/jtreg_open_test_jdk_tier2_part2/scratch/0/testUsrCustom2/unpacked-rpm/usrbuz/usrcustom2usrtreetest/lib/runtime/lib/libnet.so
      7fcd40033000-7fcd40034000 r--p 00014000 08:03 945362888 /opt/mach5/mesos/work_dir/slaves/28992c6d-c35d-42fa-8099-898223bf183b-S25565/frameworks/1735e8a2-a1db-478c-8104-60c8b0af87dd-0196/executors/eb111d30-729c-491b-ae4c-8ffe84ea5d2a/runs/b5bfaf83-646d-4d87-9a47-7980925df9ea/testoutput/test-support/jtreg_open_test_jdk_tier2_part2/scratch/0/testUsrCustom2/unpacked-rpm/usrbuz/usrcustom2usrtreetest/lib/runtime/lib/libnet.so
      7fcd40034000-7fcd40035000 rw-p 00015000 08:03 945362888 /opt/mach5/mesos/work_dir/slaves/28992c6d-c35d-42fa-8099-898223bf183b-S25565/frameworks/1735e8a2-a1db-478c-8104-60c8b0af87dd-0196/executors/eb111d30-729c-491b-ae4c-8ffe84ea5d2a/runs/b5bfaf83-646d-4d87-9a47-7980925df9ea/testoutput/test-support/jtreg_open_test_jdk_tier2_part2/scratch/0/testUsrCustom2/unpacked-rpm/usrbuz/usrcustom2usrtreetest/lib/runtime/lib/libnet.so
      7fcd40035000-7fcd40090000 rw-p 00000000 00:00 0
      7fcd40090000-7fcd40091000 ---p 00000000 00:00 0
      7fcd40091000-7fcd40192000 rw-p 00000000 00:00 0
      7fcd40192000-7fcd40193000 ---p 00000000 00:00 0
      7fcd40193000-7fcd4126c000 rw-p 00000000 00:00 0
      7fcd4126c000-7fcd486fc000 ---p 00000000 00:00 0
      7fcd486fc000-7fcd48ecc000 rw-p 00000000 00:00 0
      7fcd48ecc000-7fcd5035c000 ---p 00000000 00:00 0
      7fcd5035c000-7fcd50456000 rw-p 00000000 00:00 0
      7fcd50456000-7fcd512e8000 ---p 00000000 00:00 0
      7fcd512e8000-7fcd513e2000 rw-p 00000000 00:00 0
      7fcd513e2000-7fcd52274000 ---p 00000000 00:00 0
      7fcd52274000-7fcd5236e000 rw-p 00000000 00:00 0
      7fcd5236e000-7fcd53200000 ---p 00000000 00:00 0
      7fcd53200000-7fcd53470000 rwxp 00000000 00:00 0
      7fcd53470000-7fcd53792000 ---p 00000000 00:00 0
      7fcd53792000-7fcd53a02000 rwxp 00000000 00:00 0
      7fcd53a02000-7fcd5acc9000 ---p 00000000 00:00 0
      7fcd5acc9000-7fcd5af39000 rwxp 00000000 00:00 0
      7fcd5af39000-7fcd62200000 ---p 00000000 00:00 0
      7fcd62200000-7fcd68000000 r--s 00000000 08:03 945362898 /opt/mach5/mesos/work_dir/slaves/28992c6d-c35d-42fa-8099-898223bf183b-S25565/frameworks/1735e8a2-a1db-478c-8104-60c8b0af87dd-0196/executors/eb111d30-729c-491b-ae4c-8ffe84ea5d2a/runs/b5bfaf83-646d-4d87-9a47-7980925df9ea/testoutput/test-support/jtreg_open_test_jdk_tier2_part2/scratch/0/testUsrCustom2/unpacked-rpm/usrbuz/usrcustom2usrtreetest/lib/runtime/lib/modules
      7fcd68000000-7fcd682a4000 rw-p 00000000 00:00 0
      7fcd682a4000-7fcd6c000000 ---p 00000000 00:00 0
      7fcd6c008000-7fcd6c01b000 r-xp 00000000 08:03 945362889 /opt/mach5/mesos/work_dir/slaves/28992c6d-c35d-42fa-8099-898223bf183b-S25565/frameworks/1735e8a2-a1db-478c-8104-60c8b0af87dd-0196/executors/eb111d30-729c-491b-ae4c-8ffe84ea5d2a/runs/b5bfaf83-646d-4d87-9a47-7980925df9ea/testoutput/test-support/jtreg_open_test_jdk_tier2_part2/scratch/0/testUsrCustom2/unpacked-rpm/usrbuz/usrcustom2usrtreetest/lib/runtime/lib/libnio.so
      7fcd6c01b000-7fcd6c01c000 r--p 00012000 08:03 945362889 /opt/mach5/mesos/work_dir/slaves/28992c6d-c35d-42fa-8099-898223bf183b-S25565/frameworks/1735e8a2-a1db-478c-8104-60c8b0af87dd-0196/executors/eb111d30-729c-491b-ae4c-8ffe84ea5d2a/runs/b5bfaf83-646d-4d87-9a47-7980925df9ea/testoutput/test-support/jtreg_open_test_jdk_tier2_part2/scratch/0/testUsrCustom2/unpacked-rpm/usrbuz/usrcustom2usrtreetest/lib/runtime/lib/libnio.so
      7fcd6c01c000-7fcd6c01d000 rw-p 00013000 08:03 945362889 /opt/mach5/mesos/work_dir/slaves/28992c6d-c35d-42fa-8099-898223bf183b-S25565/frameworks/1735e8a2-a1db-478c-8104-60c8b0af87dd-0196/executors/eb111d30-729c-491b-ae4c-8ffe84ea5d2a/runs/b5bfaf83-646d-4d87-9a47-7980925df9ea/testoutput/test-support/jtreg_open_test_jdk_tier2_part2/scratch/0/testUsrCustom2/unpacked-rpm/usrbuz/usrcustom2usrtreetest/lib/runtime/lib/libnio.so
      7fcd6c01d000-7fcd6c01e000 ---p 00000000 00:00 0
      7fcd6c01e000-7fcd6c11f000 rw-p 00000000 00:00 0
      7fcd6c11f000-7fcd6c120000 ---p 00000000 00:00 0
      7fcd6c120000-7fcd6c221000 rw-p 00000000 00:00 0
      7fcd6c221000-7fcd6c222000 ---p 00000000 00:00 0
      7fcd6c222000-7fcd6cbb1000 rw-p 00000000 00:00 0
      7fcd6cbb1000-7fcd6cc97000 ---p 00000000 00:00 0
      7fcd6cc97000-7fcd6cc9c000 rw-p 00000000 00:00 0
      7fcd6cc9c000-7fcd6cd82000 ---p 00000000 00:00 0
      7fcd6cd82000-7fcd6cd8e000 r-xp 00000000 08:03 833197 /usr/lib64/libnss_files-2.17.so
      7fcd6cd8e000-7fcd6cf8d000 ---p 0000c000 08:03 833197 /usr/lib64/libnss_files-2.17.so
      7fcd6cf8d000-7fcd6cf8e000 r--p 0000b000 08:03 833197 /usr/lib64/libnss_files-2.17.so
      7fcd6cf8e000-7fcd6cf8f000 rw-p 0000c000 08:03 833197 /usr/lib64/libnss_files-2.17.so
      7fcd6cf8f000-7fcd6cf95000 rw-p 00000000 00:00 0
      7fcd6cf95000-7fcd6d096000 r-xp 00000000 08:03 833187 /usr/lib64/libm-2.17.so
      7fcd6d096000-7fcd6d295000 ---p 00101000 08:03 833187 /usr/lib64/libm-2.17.so
      7fcd6d295000-7fcd6d296000 r--p 00100000 08:03 833187 /usr/lib64/libm-2.17.so
      7fcd6d296000-7fcd6d297000 rw-p 00101000 08:03 833187 /usr/lib64/libm-2.17.so
      7fcd6d297000-7fcd6d29e000 r-xp 00000000 08:03 833209 /usr/lib64/librt-2.17.so
      7fcd6d29e000-7fcd6d49d000 ---p 00007000 08:03 833209 /usr/lib64/librt-2.17.so
      7fcd6d49d000-7fcd6d49e000 r--p 00006000 08:03 833209 /usr/lib64/librt-2.17.so
      7fcd6d49e000-7fcd6d49f000 rw-p 00007000 08:03 833209 /usr/lib64/librt-2.17.so
      7fcd6d49f000-7fcd6e584000 r-xp 00000000 08:03 207788960 /opt/mach5/mesos/work_dir/slaves/28992c6d-c35d-42fa-8099-898223bf183b-S25565/frameworks/1735e8a2-a1db-478c-8104-60c8b0af87dd-0196/executors/eb111d30-729c-491b-ae4c-8ffe84ea5d2a/runs/b5bfaf83-646d-4d87-9a47-7980925df9ea/testoutput/test-support/jtreg_open_test_jdk_tier2_part2/scratch/0/testUsrCustom2/unpacked-rpm/usrbuz/usrcustom2usrtreetest/lib/runtime/lib/server/libjvm.so
      7fcd6e584000-7fcd6e635000 r--p 010e4000 08:03 207788960 /opt/mach5/mesos/work_dir/slaves/28992c6d-c35d-42fa-8099-898223bf183b-S25565/frameworks/1735e8a2-a1db-478c-8104-60c8b0af87dd-0196/executors/eb111d30-729c-491b-ae4c-8ffe84ea5d2a/runs/b5bfaf83-646d-4d87-9a47-7980925df9ea/testoutput/test-support/jtreg_open_test_jdk_tier2_part2/scratch/0/testUsrCustom2/unpacked-rpm/usrbuz/usrcustom2usrtreetest/lib/runtime/lib/server/libjvm.so
      7fcd6e635000-7fcd6e668000 rw-p 01195000 08:03 207788960 /opt/mach5/mesos/work_dir/slaves/28992c6d-c35d-42fa-8099-898223bf183b-S25565/frameworks/1735e8a2-a1db-478c-8104-60c8b0af87dd-0196/executors/eb111d30-729c-491b-ae4c-8ffe84ea5d2a/runs/b5bfaf83-646d-4d87-9a47-7980925df9ea/testoutput/test-support/jtreg_open_test_jdk_tier2_part2/scratch/0/testUsrCustom2/unpacked-rpm/usrbuz/usrcustom2usrtreetest/lib/runtime/lib/server/libjvm.so
      7fcd6e668000-7fcd6e6c0000 rw-p 00000000 00:00 0
      7fcd6e6c0000-7fcd6e6d7000 r-xp 00000000 08:03 833205 /usr/lib64/libpthread-2.17.so
      7fcd6e6d7000-7fcd6e8d6000 ---p 00017000 08:03 833205 /usr/lib64/libpthread-2.17.so
      7fcd6e8d6000-7fcd6e8d7000 r--p 00016000 08:03 833205 /usr/lib64/libpthread-2.17.so
      7fcd6e8d7000-7fcd6e8d8000 rw-p 00017000 08:03 833205 /usr/lib64/libpthread-2.17.so
      7fcd6e8d8000-7fcd6e8dc000 rw-p 00000000 00:00 0
      7fcd6e8dc000-7fcd6e8f1000 r-xp 00000000 08:03 833226 /usr/lib64/libz.so.1.2.7
      7fcd6e8f1000-7fcd6eaf0000 ---p 00015000 08:03 833226 /usr/lib64/libz.so.1.2.7
      7fcd6eaf0000-7fcd6eaf1000 r--p 00014000 08:03 833226 /usr/lib64/libz.so.1.2.7
      7fcd6eaf1000-7fcd6eaf2000 rw-p 00015000 08:03 833226 /usr/lib64/libz.so.1.2.7
      7fcd6eaf2000-7fcd6ecb6000 r-xp 00000000 08:03 1384403 /usr/lib64/libc-2.17.so
      7fcd6ecb6000-7fcd6eeb5000 ---p 001c4000 08:03 1384403 /usr/lib64/libc-2.17.so
      7fcd6eeb5000-7fcd6eeb9000 r--p 001c3000 08:03 1384403 /usr/lib64/libc-2.17.so
      7fcd6eeb9000-7fcd6eebb000 rw-p 001c7000 08:03 1384403 /usr/lib64/libc-2.17.so
      7fcd6eebb000-7fcd6eec0000 rw-p 00000000 00:00 0
      7fcd6eec0000-7fcd6eec2000 r-xp 00000000 08:03 833185 /usr/lib64/libdl-2.17.so
      7fcd6eec2000-7fcd6f0c2000 ---p 00002000 08:03 833185 /usr/lib64/libdl-2.17.so
      7fcd6f0c2000-7fcd6f0c3000 r--p 00002000 08:03 833185 /usr/lib64/libdl-2.17.so
      7fcd6f0c3000-7fcd6f0c4000 rw-p 00003000 08:03 833185 /usr/lib64/libdl-2.17.so
      7fcd6f0c4000-7fcd6f0e6000 r-xp 00000000 08:03 1384390 /usr/lib64/ld-2.17.so
      7fcd6f0ef000-7fcd6f174000 rw-p 00000000 00:00 0
      7fcd6f174000-7fcd6f17b000 ---p 00000000 00:00 0
      7fcd6f17b000-7fcd6f19f000 r-xp 00000000 08:03 945363000 /opt/mach5/mesos/work_dir/slaves/28992c6d-c35d-42fa-8099-898223bf183b-S25565/frameworks/1735e8a2-a1db-478c-8104-60c8b0af87dd-0196/executors/eb111d30-729c-491b-ae4c-8ffe84ea5d2a/runs/b5bfaf83-646d-4d87-9a47-7980925df9ea/testoutput/test-support/jtreg_open_test_jdk_tier2_part2/scratch/0/testUsrCustom2/unpacked-rpm/usrbuz/usrcustom2usrtreetest/lib/runtime/lib/libjava.so
      7fcd6f19f000-7fcd6f1a0000 ---p 00024000 08:03 945363000 /opt/mach5/mesos/work_dir/slaves/28992c6d-c35d-42fa-8099-898223bf183b-S25565/frameworks/1735e8a2-a1db-478c-8104-60c8b0af87dd-0196/executors/eb111d30-729c-491b-ae4c-8ffe84ea5d2a/runs/b5bfaf83-646d-4d87-9a47-7980925df9ea/testoutput/test-support/jtreg_open_test_jdk_tier2_part2/scratch/0/testUsrCustom2/unpacked-rpm/usrbuz/usrcustom2usrtreetest/lib/runtime/lib/libjava.so
      7fcd6f1a0000-7fcd6f1a1000 r--p 00024000 08:03 945363000 /opt/mach5/mesos/work_dir/slaves/28992c6d-c35d-42fa-8099-898223bf183b-S25565/frameworks/1735e8a2-a1db-478c-8104-60c8b0af87dd-0196/executors/eb111d30-729c-491b-ae4c-8ffe84ea5d2a/runs/b5bfaf83-646d-4d87-9a47-7980925df9ea/testoutput/test-support/jtreg_open_test_jdk_tier2_part2/scratch/0/testUsrCustom2/unpacked-rpm/usrbuz/usrcustom2usrtreetest/lib/runtime/lib/libjava.so
      7fcd6f1a1000-7fcd6f1a2000 rw-p 00025000 08:03 945363000 /opt/mach5/mesos/work_dir/slaves/28992c6d-c35d-42fa-8099-898223bf183b-S25565/frameworks/1735e8a2-a1db-478c-8104-60c8b0af87dd-0196/executors/eb111d30-729c-491b-ae4c-8ffe84ea5d2a/runs/b5bfaf83-646d-4d87-9a47-7980925df9ea/testoutput/test-support/jtreg_open_test_jdk_tier2_part2/scratch/0/testUsrCustom2/unpacked-rpm/usrbuz/usrcustom2usrtreetest/lib/runtime/lib/libjava.so
      7fcd6f1a2000-7fcd6f1a3000 rw-p 00000000 00:00 0
      7fcd6f1a3000-7fcd6f1be000 r-xp 00000000 08:03 945363015 /opt/mach5/mesos/work_dir/slaves/28992c6d-c35d-42fa-8099-898223bf183b-S25565/frameworks/1735e8a2-a1db-478c-8104-60c8b0af87dd-0196/executors/eb111d30-729c-491b-ae4c-8ffe84ea5d2a/runs/b5bfaf83-646d-4d87-9a47-7980925df9ea/testoutput/test-support/jtreg_open_test_jdk_tier2_part2/scratch/0/testUsrCustom2/unpacked-rpm/usrbuz/usrcustom2usrtreetest/lib/runtime/lib/libjimage.so
      7fcd6f1be000-7fcd6f1bf000 ---p 0001b000 08:03 945363015 /opt/mach5/mesos/work_dir/slaves/28992c6d-c35d-42fa-8099-898223bf183b-S25565/frameworks/1735e8a2-a1db-478c-8104-60c8b0af87dd-0196/executors/eb111d30-729c-491b-ae4c-8ffe84ea5d2a/runs/b5bfaf83-646d-4d87-9a47-7980925df9ea/testoutput/test-support/jtreg_open_test_jdk_tier2_part2/scratch/0/testUsrCustom2/unpacked-rpm/usrbuz/usrcustom2usrtreetest/lib/runtime/lib/libjimage.so
      7fcd6f1bf000-7fcd6f1c1000 r--p 0001b000 08:03 945363015 /opt/mach5/mesos/work_dir/slaves/28992c6d-c35d-42fa-8099-898223bf183b-S25565/frameworks/1735e8a2-a1db-478c-8104-60c8b0af87dd-0196/executors/eb111d30-729c-491b-ae4c-8ffe84ea5d2a/runs/b5bfaf83-646d-4d87-9a47-7980925df9ea/testoutput/test-support/jtreg_open_test_jdk_tier2_part2/scratch/0/testUsrCustom2/unpacked-rpm/usrbuz/usrcustom2usrtreetest/lib/runtime/lib/libjimage.so
      7fcd6f1c1000-7fcd6f1c2000 rw-p 0001d000 08:03 945363015 /opt/mach5/mesos/work_dir/slaves/28992c6d-c35d-42fa-8099-898223bf183b-S25565/frameworks/1735e8a2-a1db-478c-8104-60c8b0af87dd-0196/executors/eb111d30-729c-491b-ae4c-8ffe84ea5d2a/runs/b5bfaf83-646d-4d87-9a47-7980925df9ea/testoutput/test-support/jtreg_open_test_jdk_tier2_part2/scratch/0/testUsrCustom2/unpacked-rpm/usrbuz/usrcustom2usrtreetest/lib/runtime/lib/libjimage.so
      7fcd6f1c2000-7fcd6f1c6000 ---p 00000000 00:00 0
      7fcd6f1c6000-7fcd6f2c3000 rw-p 00000000 00:00 0
      7fcd6f2c3000-7fcd6f2d2000 r-xp 00000000 08:03 945362880 /opt/mach5/mesos/work_dir/slaves/28992c6d-c35d-42fa-8099-898223bf183b-S25565/frameworks/1735e8a2-a1db-478c-8104-60c8b0af87dd-0196/executors/eb111d30-729c-491b-ae4c-8ffe84ea5d2a/runs/b5bfaf83-646d-4d87-9a47-7980925df9ea/testoutput/test-support/jtreg_open_test_jdk_tier2_part2/scratch/0/testUsrCustom2/unpacked-rpm/usrbuz/usrcustom2usrtreetest/lib/runtime/lib/libjli.so
      7fcd6f2d2000-7fcd6f2d3000 r--p 0000e000 08:03 945362880 /opt/mach5/mesos/work_dir/slaves/28992c6d-c35d-42fa-8099-898223bf183b-S25565/frameworks/1735e8a2-a1db-478c-8104-60c8b0af87dd-0196/executors/eb111d30-729c-491b-ae4c-8ffe84ea5d2a/runs/b5bfaf83-646d-4d87-9a47-7980925df9ea/testoutput/test-support/jtreg_open_test_jdk_tier2_part2/scratch/0/testUsrCustom2/unpacked-rpm/usrbuz/usrcustom2usrtreetest/lib/runtime/lib/libjli.so
      7fcd6f2d3000-7fcd6f2d4000 rw-p 0000f000 08:03 945362880 /opt/mach5/mesos/work_dir/slaves/28992c6d-c35d-42fa-8099-898223bf183b-S25565/frameworks/1735e8a2-a1db-478c-8104-60c8b0af87dd-0196/executors/eb111d30-729c-491b-ae4c-8ffe84ea5d2a/runs/b5bfaf83-646d-4d87-9a47-7980925df9ea/testoutput/test-support/jtreg_open_test_jdk_tier2_part2/scratch/0/testUsrCustom2/unpacked-rpm/usrbuz/usrcustom2usrtreetest/lib/runtime/lib/libjli.so
      7fcd6f2d4000-7fcd6f2d7000 rw-p 00000000 00:00 0
      7fcd6f2d8000-7fcd6f2d9000 rw-p 00000000 00:00 0
      7fcd6f2d9000-7fcd6f2e1000 rw-s 00000000 08:03 336925474 /tmp/hsperfdata_mach5-one/13329
      7fcd6f2e1000-7fcd6f2e2000 ---p 00000000 00:00 0
      7fcd6f2e2000-7fcd6f2e3000 r--p 00000000 00:00 0
      7fcd6f2e3000-7fcd6f2e4000 ---p 00000000 00:00 0
      7fcd6f2e4000-7fcd6f2e5000 rw-p 00000000 00:00 0
      7fcd6f2e5000-7fcd6f2e6000 r--p 00021000 08:03 1384390 /usr/lib64/ld-2.17.so
      7fcd6f2e6000-7fcd6f2e7000 rw-p 00022000 08:03 1384390 /usr/lib64/ld-2.17.so
      7fcd6f2e7000-7fcd6f2e8000 rw-p 00000000 00:00 0
      7fff62e44000-7fff62e65000 rw-p 00000000 00:00 0 [stack]
      7fff62e8d000-7fff62e90000 r--p 00000000 00:00 0 [vvar]
      7fff62e90000-7fff62e91000 r-xp 00000000 00:00 0 [vdso]
      ffffffffff600000-ffffffffff601000 r-xp 00000000 00:00 0 [vsyscall]
      java.lang.AssertionError: Expected [0]. Actual [134]: Check command [/opt/mach5/mesos/work_dir/slaves/28992c6d-c35d-42fa-8099-898223bf183b-S25565/frameworks/1735e8a2-a1db-478c-8104-60c8b0af87dd-0196/executors/eb111d30-729c-491b-ae4c-8ffe84ea5d2a/runs/b5bfaf83-646d-4d87-9a47-7980925df9ea/testoutput/test-support/jtreg_open_test_jdk_tier2_part2/scratch/0/./testUsrCustom2/unpacked-rpm/usrbuz/usrcustom2usrtreetest/bin/UsrCustom2UsrTreeTest](1) exited with 0 code
      at jdk.jpackage.test.TKit.error(TKit.java:293)
      at jdk.jpackage.test.TKit.assertEquals(TKit.java:596)
      at jdk.jpackage.test.Executor$Result.assertExitCodeIs(Executor.java:176)
      at jdk.jpackage.test.Executor.execute(Executor.java:214)
      at jdk.jpackage.test.Executor.execute(Executor.java:218)
      at jdk.jpackage.test.HelloApp$AppOutputVerifier.executeAndVerifyOutput(HelloApp.java:403)
      at jdk.jpackage.test.HelloApp$AppOutputVerifier.executeAndVerifyOutput(HelloApp.java:417)
      at jdk.jpackage.test.HelloApp.executeLauncherAndVerifyOutput(HelloApp.java:319)
      at jdk.jpackage.test.PackageTest.lambda$configureHelloApp$19(PackageTest.java:316)
      at jdk.jpackage.test.Functional$ThrowingConsumer.lambda$toConsumer$0(Functional.java:41)
      at jdk.jpackage.test.PackageTest$Handler.lambda$accept$0(PackageTest.java:510)
      at java.base/java.util.ArrayList.forEach(ArrayList.java:1511)
      at jdk.jpackage.test.PackageTest$Handler.verifyPackageInstalled(PackageTest.java:574)
      at jdk.jpackage.test.PackageTest$Handler.accept(PackageTest.java:529)
      at jdk.jpackage.test.PackageTest$2.accept(PackageTest.java:452)
      at jdk.jpackage.test.PackageTest$2.accept(PackageTest.java:396)
      at jdk.jpackage.test.Functional$ThrowingConsumer.lambda$toConsumer$0(Functional.java:41)
      at java.base/java.lang.Iterable.forEach(Iterable.java:75)
      at jdk.jpackage.test.PackageTest.lambda$runActions$20(PackageTest.java:360)
      at java.base/java.util.ArrayList.forEach(ArrayList.java:1511)
      at jdk.jpackage.test.PackageTest.lambda$runActions$21(PackageTest.java:359)
      at java.base/java.util.ArrayList.forEach(ArrayList.java:1511)
      at jdk.jpackage.test.PackageTest.runActions(PackageTest.java:358)
      at jdk.jpackage.test.RunnablePackageTest.run(RunnablePackageTest.java:51)
      at UsrTreeTest.test(UsrTreeTest.java:109)
      at UsrTreeTest.testUsrCustom2(UsrTreeTest.java:72)
      at java.base/jdk.internal.reflect.NativeMethodAccessorImpl.invoke0(Native Method)
      at java.base/jdk.internal.reflect.NativeMethodAccessorImpl.invoke(NativeMethodAccessorImpl.java:78)
      at java.base/jdk.internal.reflect.DelegatingMethodAccessorImpl.invoke(DelegatingMethodAccessorImpl.java:43)
      at java.base/java.lang.reflect.Method.invoke(Method.java:566)
      at jdk.jpackage.test.MethodCall.accept(MethodCall.java:145)
      at jdk.jpackage.test.TestInstance.run(TestInstance.java:230)
      at jdk.jpackage.test.TKit.lambda$ignoreExceptions$6(TKit.java:155)
      at jdk.jpackage.test.TKit.lambda$runTests$4(TKit.java:140)
      at java.base/java.util.ArrayList$ArrayListSpliterator.forEachRemaining(ArrayList.java:1625)
      at java.base/java.util.stream.ReferencePipeline$Head.forEach(ReferencePipeline.java:762)
      at jdk.jpackage.test.TKit.lambda$runTests$5(TKit.java:137)
      at jdk.jpackage.test.Functional$ThrowingRunnable.lambda$toRunnable$0(Functional.java:105)
      at jdk.jpackage.test.TKit.withExtraLogStream(TKit.java:123)
      at jdk.jpackage.test.TKit.runTests(TKit.java:136)
      at jdk.jpackage.test.Main.runTests(Main.java:79)
      at jdk.jpackage.test.Main.lambda$main$2(Main.java:75)
      at jdk.jpackage.test.Functional$ThrowingRunnable.lambda$toRunnable$0(Functional.java:105)
      at jdk.jpackage.test.TKit.withExtraLogStream(TKit.java:123)
      at jdk.jpackage.test.Main.main(Main.java:75)
      at java.base/jdk.internal.reflect.NativeMethodAccessorImpl.invoke0(Native Method)
      at java.base/jdk.internal.reflect.NativeMethodAccessorImpl.invoke(NativeMethodAccessorImpl.java:78)
      at java.base/jdk.internal.reflect.DelegatingMethodAccessorImpl.invoke(DelegatingMethodAccessorImpl.java:43)
      at java.base/java.lang.reflect.Method.invoke(Method.java:566)
      at com.sun.javatest.regtest.agent.MainWrapper$MainThread.run(MainWrapper.java:127)
      at java.base/java.lang.Thread.run(Thread.java:831)
      jdk.jpackage.test.Functional$ExceptionBox: java.lang.RuntimeException: 1 FAILED TEST
      at jdk.jpackage.test.Functional.rethrowUnchecked(Functional.java:161)
      at jdk.jpackage.test.Functional$ThrowingRunnable.lambda$toRunnable$0(Functional.java:107)
      at jdk.jpackage.test.TKit.withExtraLogStream(TKit.java:123)
      at jdk.jpackage.test.Main.main(Main.java:75)
      at java.base/jdk.internal.reflect.NativeMethodAccessorImpl.invoke0(Native Method)
      at java.base/jdk.internal.reflect.NativeMethodAccessorImpl.invoke(NativeMethodAccessorImpl.java:78)
      at java.base/jdk.internal.reflect.DelegatingMethodAccessorImpl.invoke(DelegatingMethodAccessorImpl.java:43)
      at java.base/java.lang.reflect.Method.invoke(Method.java:566)
      at com.sun.javatest.regtest.agent.MainWrapper$MainThread.run(MainWrapper.java:127)
      at java.base/java.lang.Thread.run(Thread.java:831)
      Caused by: java.lang.RuntimeException: 1 FAILED TEST
      at jdk.jpackage.test.Main.reportSummary(Main.java:130)
      at jdk.jpackage.test.Main.runTests(Main.java:90)
      at jdk.jpackage.test.Main.lambda$main$2(Main.java:75)
      at jdk.jpackage.test.Functional$ThrowingRunnable.lambda$toRunnable$0(Functional.java:105)
      ... 8 more

      JavaTest Message: Test threw exception: jdk.jpackage.test.Functional$ExceptionBox: java.lang.RuntimeException: 1 FAILED TEST
      JavaTest Message: shutting down test

      STATUS:Failed.`main' threw exception: jdk.jpackage.test.Functional$ExceptionBox: java.lang.RuntimeException: 1 FAILED TEST
      ----------rerun:(40/7089)*----------

        Attachments

          Activity

            People

            Assignee:
            asemenyuk Alexey Semenyuk
            Reporter:
            dcubed Daniel Daugherty
            Votes:
            0 Vote for this issue
            Watchers:
            6 Start watching this issue

              Dates

              Created:
              Updated: