Uploaded image for project: 'JDK'
  1. JDK
  2. JDK-8266059

[macos] java/awt/security/WarningWindowDisposeTest/WarningWindowDisposeTest.java failed with "RuntimeException: Child process never exits"

    XMLWordPrintable

    Details

    • Subcomponent:
    • CPU:
      x86_64
    • OS:
      os_x

      Description

      The following test failed in the JDK17 CI:

      java/awt/security/WarningWindowDisposeTest/WarningWindowDisposeTest.java

      Here's a snippet from the log file:

      #section:main
      ----------messages:(5/210)----------
      command: main WarningWindowDisposeTest
      reason: User specified action: run main WarningWindowDisposeTest
      Mode: othervm
      Additional options from @modules: --add-modules java.desktop
      elapsed time (seconds): 10.28
      ----------configuration:(3/40)----------
      Boot Layer
        add modules: java.desktop

      ----------System.out:(1/163)----------
      policyPath in main: /System/Volumes/Data/mesos/work_dir/jib-master/install/jdk-17+20-1687/src.full/open/test/jdk/java/awt/security/WarningWindowDisposeTest/policy
      ----------System.err:(4/275)----------
      java.lang.RuntimeException: Child process never exits
      at WarningWindowDisposeTest.lambda$main$0(WarningWindowDisposeTest.java:57)
      at java.base/java.lang.Thread.run(Thread.java:831)
      STATUS:Failed.`main' threw exception: java.lang.RuntimeException: Child process never exits
      ----------rerun:(41/6885)*----------

        Attachments

          Activity

            People

            Assignee:
            Unassigned Unassigned
            Reporter:
            dcubed Daniel Daugherty
            Votes:
            0 Vote for this issue
            Watchers:
            3 Start watching this issue

              Dates

              Created:
              Updated: