Uploaded image for project: 'JDK'
  1. JDK
  2. JDK-8266249

javax/swing/JPopupMenu/7156657/bug7156657.java fails on macOS

    XMLWordPrintable

    Details

    • Type: Bug
    • Status: Resolved
    • Priority: P4
    • Resolution: Fixed
    • Affects Version/s: 17
    • Fix Version/s: 17
    • Component/s: client-libs
    • Labels:
    • Subcomponent:
    • Resolved In Build:
      b22
    • CPU:
      aarch64
    • OS:
      os_x

      Description

      This test was just stabilized under bug ID https://bugs.openjdk.java.net/browse/JDK-8171381

      However a recent test run executing the jtregtests 40 times on JDK 17 for macOS 11 ARM reproduced it once - and that was using the fixed test.

      So there's still a problem with this test although a rare-ish one.

      Test log :
      ----------System.out:(0/0)----------
      ----------System.err:(13/782)----------
      java.lang.RuntimeException: The test failed
      at bug7156657.main(bug7156657.java:124)
      at java.base/jdk.internal.reflect.NativeMethodAccessorImpl.invoke0(Native Method)
      at java.base/jdk.internal.reflect.NativeMethodAccessorImpl.invoke(NativeMethodAccessorImpl.java:78)
      at java.base/jdk.internal.reflect.DelegatingMethodAccessorImpl.invoke(DelegatingMethodAccessorImpl.java:43)
      at java.base/java.lang.reflect.Method.invoke(Method.java:568)
      at com.sun.javatest.regtest.agent.MainWrapper$MainThread.run(MainWrapper.java:127)
      at java.base/java.lang.Thread.run(Thread.java:831)

      JavaTest Message: Test threw exception: java.lang.RuntimeException: The test failed
      JavaTest Message: shutting down test

      STATUS:Failed.`main' threw exception: java.lang.RuntimeException: The test failed
      ----------rerun:(42/7045)*----------

        Attachments

          Issue Links

            Activity

              People

              Assignee:
              kizune Alexander Zuev
              Reporter:
              prr Philip Race
              Votes:
              0 Vote for this issue
              Watchers:
              5 Start watching this issue

                Dates

                Created:
                Updated:
                Resolved: