Uploaded image for project: 'JDK'
  1. JDK
  2. JDK-8266784

java/text/Collator/RuleBasedCollatorTest.java fails with jtreg 6

    XMLWordPrintable

    Details

    • Subcomponent:
    • Resolved In Build:
      b22

      Description

      java/text/Collator/RuleBasedCollatorTest.java fails when run with jtreg 6, which provides TestNG 4.7.

      Here is the System.out from the test

      test RuleBasedCollatorTest.testBasicParsingOrder(): success
      test RuleBasedCollatorTest.testEquality(): success
      test RuleBasedCollatorTest.testFrenchSecondarySort("a?a", "?aa", 1): failure
      java.text.ParseException: missing char (=,;<&) : null@
      at java.base/java.text.PatternEntry$Parser.next(PatternEntry.java:254)
      at java.base/java.text.MergeCollation.addPattern(MergeCollation.java:180)
      at java.base/java.text.MergeCollation.setPattern(MergeCollation.java:166)
      at java.base/java.text.MergeCollation.<init>(MergeCollation.java:73)
      at java.base/java.text.RBTableBuilder.build(RBTableBuilder.java:113)
      at java.base/java.text.RBCollationTables.<init>(RBCollationTables.java:83)
      at java.base/java.text.RuleBasedCollator.<init>(RuleBasedCollator.java:301)
      at java.base/java.text.RuleBasedCollator.<init>(RuleBasedCollator.java:282)
      at RuleBasedCollatorTest.testFrenchSecondarySort(RuleBasedCollatorTest.java:119)
      at java.base/jdk.internal.reflect.NativeMethodAccessorImpl.invoke0(Native Method)
      at java.base/jdk.internal.reflect.NativeMethodAccessorImpl.invoke(NativeMethodAccessorImpl.java:78)
      at java.base/jdk.internal.reflect.DelegatingMethodAccessorImpl.invoke(DelegatingMethodAccessorImpl.java:43)
      at java.base/java.lang.reflect.Method.invoke(Method.java:568)
      at org.testng.internal.MethodInvocationHelper.invokeMethod(MethodInvocationHelper.java:133)
      at org.testng.internal.TestInvoker.invokeMethod(TestInvoker.java:598)
      at org.testng.internal.TestInvoker.invokeTestMethod(TestInvoker.java:173)
      at org.testng.internal.MethodRunner.runInSequence(MethodRunner.java:46)
      at org.testng.internal.TestInvoker$MethodInvocationAgent.invoke(TestInvoker.java:824)
      at org.testng.internal.TestInvoker.invokeTestMethods(TestInvoker.java:146)
      at org.testng.internal.TestMethodWorker.invokeTestMethods(TestMethodWorker.java:146)
      at org.testng.internal.TestMethodWorker.run(TestMethodWorker.java:128)
      at java.base/java.util.ArrayList.forEach(ArrayList.java:1511)
      at org.testng.TestRunner.privateRun(TestRunner.java:794)
      at org.testng.TestRunner.run(TestRunner.java:596)
      at org.testng.SuiteRunner.runTest(SuiteRunner.java:377)
      at org.testng.SuiteRunner.runSequentially(SuiteRunner.java:371)
      at org.testng.SuiteRunner.privateRun(SuiteRunner.java:332)
      at org.testng.SuiteRunner.run(SuiteRunner.java:276)
      at org.testng.SuiteRunnerWorker.runSuite(SuiteRunnerWorker.java:53)
      at org.testng.SuiteRunnerWorker.run(SuiteRunnerWorker.java:96)
      at org.testng.TestNG.runSuitesSequentially(TestNG.java:1212)
      at org.testng.TestNG.runSuitesLocally(TestNG.java:1134)
      at org.testng.TestNG.runSuites(TestNG.java:1063)
      at org.testng.TestNG.run(TestNG.java:1031)
      at com.sun.javatest.regtest.agent.TestNGRunner.main(TestNGRunner.java:94)
      at com.sun.javatest.regtest.agent.TestNGRunner.main(TestNGRunner.java:54)
      at java.base/jdk.internal.reflect.NativeMethodAccessorImpl.invoke0(Native Method)
      at java.base/jdk.internal.reflect.NativeMethodAccessorImpl.invoke(NativeMethodAccessorImpl.java:78)
      at java.base/jdk.internal.reflect.DelegatingMethodAccessorImpl.invoke(DelegatingMethodAccessorImpl.java:43)
      at java.base/java.lang.reflect.Method.invoke(Method.java:568)
      at com.sun.javatest.regtest.agent.MainWrapper$MainThread.run(MainWrapper.java:127)
      at java.base/java.lang.Thread.run(Thread.java:831)
      test RuleBasedCollatorTest.testFrenchSecondarySort("?a", "?A", -1): failure
      java.text.ParseException: missing char (=,;<&) : null@
      at java.base/java.text.PatternEntry$Parser.next(PatternEntry.java:254)
      at java.base/java.text.MergeCollation.addPattern(MergeCollation.java:180)
      at java.base/java.text.MergeCollation.setPattern(MergeCollation.java:166)
      at java.base/java.text.MergeCollation.<init>(MergeCollation.java:73)
      at java.base/java.text.RBTableBuilder.build(RBTableBuilder.java:113)
      at java.base/java.text.RBCollationTables.<init>(RBCollationTables.java:83)
      at java.base/java.text.RuleBasedCollator.<init>(RuleBasedCollator.java:301)
      at java.base/java.text.RuleBasedCollator.<init>(RuleBasedCollator.java:282)
      at RuleBasedCollatorTest.testFrenchSecondarySort(RuleBasedCollatorTest.java:119)
      at java.base/jdk.internal.reflect.NativeMethodAccessorImpl.invoke0(Native Method)
      at java.base/jdk.internal.reflect.NativeMethodAccessorImpl.invoke(NativeMethodAccessorImpl.java:78)
      at java.base/jdk.internal.reflect.DelegatingMethodAccessorImpl.invoke(DelegatingMethodAccessorImpl.java:43)
      at java.base/java.lang.reflect.Method.invoke(Method.java:568)
      at org.testng.internal.MethodInvocationHelper.invokeMethod(MethodInvocationHelper.java:133)
      at org.testng.internal.TestInvoker.invokeMethod(TestInvoker.java:598)
      at org.testng.internal.TestInvoker.invokeTestMethod(TestInvoker.java:173)
      at org.testng.internal.MethodRunner.runInSequence(MethodRunner.java:46)
      at org.testng.internal.TestInvoker$MethodInvocationAgent.invoke(TestInvoker.java:824)
      at org.testng.internal.TestInvoker.invokeTestMethods(TestInvoker.java:146)
      at org.testng.internal.TestMethodWorker.invokeTestMethods(TestMethodWorker.java:146)
      at org.testng.internal.TestMethodWorker.run(TestMethodWorker.java:128)
      at java.base/java.util.ArrayList.forEach(ArrayList.java:1511)
      at org.testng.TestRunner.privateRun(TestRunner.java:794)
      at org.testng.TestRunner.run(TestRunner.java:596)
      at org.testng.SuiteRunner.runTest(SuiteRunner.java:377)
      at org.testng.SuiteRunner.runSequentially(SuiteRunner.java:371)
      at org.testng.SuiteRunner.privateRun(SuiteRunner.java:332)
      at org.testng.SuiteRunner.run(SuiteRunner.java:276)
      at org.testng.SuiteRunnerWorker.runSuite(SuiteRunnerWorker.java:53)
      at org.testng.SuiteRunnerWorker.run(SuiteRunnerWorker.java:96)
      at org.testng.TestNG.runSuitesSequentially(TestNG.java:1212)
      at org.testng.TestNG.runSuitesLocally(TestNG.java:1134)
      at org.testng.TestNG.runSuites(TestNG.java:1063)
      at org.testng.TestNG.run(TestNG.java:1031)
      at com.sun.javatest.regtest.agent.TestNGRunner.main(TestNGRunner.java:94)
      at com.sun.javatest.regtest.agent.TestNGRunner.main(TestNGRunner.java:54)
      at java.base/jdk.internal.reflect.NativeMethodAccessorImpl.invoke0(Native Method)
      at java.base/jdk.internal.reflect.NativeMethodAccessorImpl.invoke(NativeMethodAccessorImpl.java:78)
      at java.base/jdk.internal.reflect.DelegatingMethodAccessorImpl.invoke(DelegatingMethodAccessorImpl.java:43)
      at java.base/java.lang.reflect.Method.invoke(Method.java:568)
      at com.sun.javatest.regtest.agent.MainWrapper$MainThread.run(MainWrapper.java:127)
      at java.base/java.lang.Thread.run(Thread.java:831)
      test RuleBasedCollatorTest.testFrenchSecondarySort("?b", "?A", 1): failure
      java.text.ParseException: missing char (=,;<&) : null@
      at java.base/java.text.PatternEntry$Parser.next(PatternEntry.java:254)
      at java.base/java.text.MergeCollation.addPattern(MergeCollation.java:180)
      at java.base/java.text.MergeCollation.setPattern(MergeCollation.java:166)
      at java.base/java.text.MergeCollation.<init>(MergeCollation.java:73)
      at java.base/java.text.RBTableBuilder.build(RBTableBuilder.java:113)
      at java.base/java.text.RBCollationTables.<init>(RBCollationTables.java:83)
      at java.base/java.text.RuleBasedCollator.<init>(RuleBasedCollator.java:301)
      at java.base/java.text.RuleBasedCollator.<init>(RuleBasedCollator.java:282)
      at RuleBasedCollatorTest.testFrenchSecondarySort(RuleBasedCollatorTest.java:119)
      at java.base/jdk.internal.reflect.NativeMethodAccessorImpl.invoke0(Native Method)
      at java.base/jdk.internal.reflect.NativeMethodAccessorImpl.invoke(NativeMethodAccessorImpl.java:78)
      at java.base/jdk.internal.reflect.DelegatingMethodAccessorImpl.invoke(DelegatingMethodAccessorImpl.java:43)
      at java.base/java.lang.reflect.Method.invoke(Method.java:568)
      at org.testng.internal.MethodInvocationHelper.invokeMethod(MethodInvocationHelper.java:133)
      at org.testng.internal.TestInvoker.invokeMethod(TestInvoker.java:598)
      at org.testng.internal.TestInvoker.invokeTestMethod(TestInvoker.java:173)
      at org.testng.internal.MethodRunner.runInSequence(MethodRunner.java:46)
      at org.testng.internal.TestInvoker$MethodInvocationAgent.invoke(TestInvoker.java:824)
      at org.testng.internal.TestInvoker.invokeTestMethods(TestInvoker.java:146)
      at org.testng.internal.TestMethodWorker.invokeTestMethods(TestMethodWorker.java:146)
      at org.testng.internal.TestMethodWorker.run(TestMethodWorker.java:128)
      at java.base/java.util.ArrayList.forEach(ArrayList.java:1511)
      at org.testng.TestRunner.privateRun(TestRunner.java:794)
      at org.testng.TestRunner.run(TestRunner.java:596)
      at org.testng.SuiteRunner.runTest(SuiteRunner.java:377)
      at org.testng.SuiteRunner.runSequentially(SuiteRunner.java:371)
      at org.testng.SuiteRunner.privateRun(SuiteRunner.java:332)
      at org.testng.SuiteRunner.run(SuiteRunner.java:276)
      at org.testng.SuiteRunnerWorker.runSuite(SuiteRunnerWorker.java:53)
      at org.testng.SuiteRunnerWorker.run(SuiteRunnerWorker.java:96)
      at org.testng.TestNG.runSuitesSequentially(TestNG.java:1212)
      at org.testng.TestNG.runSuitesLocally(TestNG.java:1134)
      at org.testng.TestNG.runSuites(TestNG.java:1063)
      at org.testng.TestNG.run(TestNG.java:1031)
      at com.sun.javatest.regtest.agent.TestNGRunner.main(TestNGRunner.java:94)
      at com.sun.javatest.regtest.agent.TestNGRunner.main(TestNGRunner.java:54)
      at java.base/jdk.internal.reflect.NativeMethodAccessorImpl.invoke0(Native Method)
      at java.base/jdk.internal.reflect.NativeMethodAccessorImpl.invoke(NativeMethodAccessorImpl.java:78)
      at java.base/jdk.internal.reflect.DelegatingMethodAccessorImpl.invoke(DelegatingMethodAccessorImpl.java:43)
      at java.base/java.lang.reflect.Method.invoke(Method.java:568)
      at com.sun.javatest.regtest.agent.MainWrapper$MainThread.run(MainWrapper.java:127)
      at java.base/java.lang.Thread.run(Thread.java:831)
      test RuleBasedCollatorTest.testFrenchSecondarySort("?", "?", -1): failure
      java.text.ParseException: missing char (=,;<&) : null@
      at java.base/java.text.PatternEntry$Parser.next(PatternEntry.java:254)
      at java.base/java.text.MergeCollation.addPattern(MergeCollation.java:180)
      at java.base/java.text.MergeCollation.setPattern(MergeCollation.java:166)
      at java.base/java.text.MergeCollation.<init>(MergeCollation.java:73)
      at java.base/java.text.RBTableBuilder.build(RBTableBuilder.java:113)
      at java.base/java.text.RBCollationTables.<init>(RBCollationTables.java:83)
      at java.base/java.text.RuleBasedCollator.<init>(RuleBasedCollator.java:301)
      at java.base/java.text.RuleBasedCollator.<init>(RuleBasedCollator.java:282)
      at RuleBasedCollatorTest.testFrenchSecondarySort(RuleBasedCollatorTest.java:119)
      at java.base/jdk.internal.reflect.NativeMethodAccessorImpl.invoke0(Native Method)
      at java.base/jdk.internal.reflect.NativeMethodAccessorImpl.invoke(NativeMethodAccessorImpl.java:78)
      at java.base/jdk.internal.reflect.DelegatingMethodAccessorImpl.invoke(DelegatingMethodAccessorImpl.java:43)
      at java.base/java.lang.reflect.Method.invoke(Method.java:568)
      at org.testng.internal.MethodInvocationHelper.invokeMethod(MethodInvocationHelper.java:133)
      at org.testng.internal.TestInvoker.invokeMethod(TestInvoker.java:598)
      at org.testng.internal.TestInvoker.invokeTestMethod(TestInvoker.java:173)
      at org.testng.internal.MethodRunner.runInSequence(MethodRunner.java:46)
      at org.testng.internal.TestInvoker$MethodInvocationAgent.invoke(TestInvoker.java:824)
      at org.testng.internal.TestInvoker.invokeTestMethods(TestInvoker.java:146)
      at org.testng.internal.TestMethodWorker.invokeTestMethods(TestMethodWorker.java:146)
      at org.testng.internal.TestMethodWorker.run(TestMethodWorker.java:128)
      at java.base/java.util.ArrayList.forEach(ArrayList.java:1511)
      at org.testng.TestRunner.privateRun(TestRunner.java:794)
      at org.testng.TestRunner.run(TestRunner.java:596)
      at org.testng.SuiteRunner.runTest(SuiteRunner.java:377)
      at org.testng.SuiteRunner.runSequentially(SuiteRunner.java:371)
      at org.testng.SuiteRunner.privateRun(SuiteRunner.java:332)
      at org.testng.SuiteRunner.run(SuiteRunner.java:276)
      at org.testng.SuiteRunnerWorker.runSuite(SuiteRunnerWorker.java:53)
      at org.testng.SuiteRunnerWorker.run(SuiteRunnerWorker.java:96)
      at org.testng.TestNG.runSuitesSequentially(TestNG.java:1212)
      at org.testng.TestNG.runSuitesLocally(TestNG.java:1134)
      at org.testng.TestNG.runSuites(TestNG.java:1063)
      at org.testng.TestNG.run(TestNG.java:1031)
      at com.sun.javatest.regtest.agent.TestNGRunner.main(TestNGRunner.java:94)
      at com.sun.javatest.regtest.agent.TestNGRunner.main(TestNGRunner.java:54)
      at java.base/jdk.internal.reflect.NativeMethodAccessorImpl.invoke0(Native Method)
      at java.base/jdk.internal.reflect.NativeMethodAccessorImpl.invoke(NativeMethodAccessorImpl.java:78)
      at java.base/jdk.internal.reflect.DelegatingMethodAccessorImpl.invoke(DelegatingMethodAccessorImpl.java:43)
      at java.base/java.lang.reflect.Method.invoke(Method.java:568)
      at com.sun.javatest.regtest.agent.MainWrapper$MainThread.run(MainWrapper.java:127)
      at java.base/java.lang.Thread.run(Thread.java:831)
      test RuleBasedCollatorTest.testFrenchSecondarySort("a", "?", -1): failure
      java.text.ParseException: missing char (=,;<&) : null@
      at java.base/java.text.PatternEntry$Parser.next(PatternEntry.java:254)
      at java.base/java.text.MergeCollation.addPattern(MergeCollation.java:180)
      at java.base/java.text.MergeCollation.setPattern(MergeCollation.java:166)
      at java.base/java.text.MergeCollation.<init>(MergeCollation.java:73)
      at java.base/java.text.RBTableBuilder.build(RBTableBuilder.java:113)
      at java.base/java.text.RBCollationTables.<init>(RBCollationTables.java:83)
      at java.base/java.text.RuleBasedCollator.<init>(RuleBasedCollator.java:301)
      at java.base/java.text.RuleBasedCollator.<init>(RuleBasedCollator.java:282)
      at RuleBasedCollatorTest.testFrenchSecondarySort(RuleBasedCollatorTest.java:119)
      at java.base/jdk.internal.reflect.NativeMethodAccessorImpl.invoke0(Native Method)
      at java.base/jdk.internal.reflect.NativeMethodAccessorImpl.invoke(NativeMethodAccessorImpl.java:78)
      at java.base/jdk.internal.reflect.DelegatingMethodAccessorImpl.invoke(DelegatingMethodAccessorImpl.java:43)
      at java.base/java.lang.reflect.Method.invoke(Method.java:568)
      at org.testng.internal.MethodInvocationHelper.invokeMethod(MethodInvocationHelper.java:133)
      at org.testng.internal.TestInvoker.invokeMethod(TestInvoker.java:598)
      at org.testng.internal.TestInvoker.invokeTestMethod(TestInvoker.java:173)
      at org.testng.internal.MethodRunner.runInSequence(MethodRunner.java:46)
      at org.testng.internal.TestInvoker$MethodInvocationAgent.invoke(TestInvoker.java:824)
      at org.testng.internal.TestInvoker.invokeTestMethods(TestInvoker.java:146)
      at org.testng.internal.TestMethodWorker.invokeTestMethods(TestMethodWorker.java:146)
      at org.testng.internal.TestMethodWorker.run(TestMethodWorker.java:128)
      at java.base/java.util.ArrayList.forEach(ArrayList.java:1511)
      at org.testng.TestRunner.privateRun(TestRunner.java:794)
      at org.testng.TestRunner.run(TestRunner.java:596)
      at org.testng.SuiteRunner.runTest(SuiteRunner.java:377)
      at org.testng.SuiteRunner.runSequentially(SuiteRunner.java:371)
      at org.testng.SuiteRunner.privateRun(SuiteRunner.java:332)
      at org.testng.SuiteRunner.run(SuiteRunner.java:276)
      at org.testng.SuiteRunnerWorker.runSuite(SuiteRunnerWorker.java:53)
      at org.testng.SuiteRunnerWorker.run(SuiteRunnerWorker.java:96)
      at org.testng.TestNG.runSuitesSequentially(TestNG.java:1212)
      at org.testng.TestNG.runSuitesLocally(TestNG.java:1134)
      at org.testng.TestNG.runSuites(TestNG.java:1063)
      at org.testng.TestNG.run(TestNG.java:1031)
      at com.sun.javatest.regtest.agent.TestNGRunner.main(TestNGRunner.java:94)
      at com.sun.javatest.regtest.agent.TestNGRunner.main(TestNGRunner.java:54)
      at java.base/jdk.internal.reflect.NativeMethodAccessorImpl.invoke0(Native Method)
      at java.base/jdk.internal.reflect.NativeMethodAccessorImpl.invoke(NativeMethodAccessorImpl.java:78)
      at java.base/jdk.internal.reflect.DelegatingMethodAccessorImpl.invoke(DelegatingMethodAccessorImpl.java:43)
      at java.base/java.lang.reflect.Method.invoke(Method.java:568)
      at com.sun.javatest.regtest.agent.MainWrapper$MainThread.run(MainWrapper.java:127)
      at java.base/java.lang.Thread.run(Thread.java:831)
      test RuleBasedCollatorTest.testIgnorableCharacter(): success
      test RuleBasedCollatorTest.testNormalization("?", "?", 0, -1): failure
      java.lang.NullPointerException: Cannot invoke "java.text.RuleBasedCollator.clone()" because "RuleBasedCollatorTest.USC" is null
      at RuleBasedCollatorTest.testNormalization(RuleBasedCollatorTest.java:168)
      at java.base/jdk.internal.reflect.NativeMethodAccessorImpl.invoke0(Native Method)
      at java.base/jdk.internal.reflect.NativeMethodAccessorImpl.invoke(NativeMethodAccessorImpl.java:78)
      at java.base/jdk.internal.reflect.DelegatingMethodAccessorImpl.invoke(DelegatingMethodAccessorImpl.java:43)
      at java.base/java.lang.reflect.Method.invoke(Method.java:568)
      at org.testng.internal.MethodInvocationHelper.invokeMethod(MethodInvocationHelper.java:133)
      at org.testng.internal.TestInvoker.invokeMethod(TestInvoker.java:598)
      at org.testng.internal.TestInvoker.invokeTestMethod(TestInvoker.java:173)
      at org.testng.internal.MethodRunner.runInSequence(MethodRunner.java:46)
      at org.testng.internal.TestInvoker$MethodInvocationAgent.invoke(TestInvoker.java:824)
      at org.testng.internal.TestInvoker.invokeTestMethods(TestInvoker.java:146)
      at org.testng.internal.TestMethodWorker.invokeTestMethods(TestMethodWorker.java:146)
      at org.testng.internal.TestMethodWorker.run(TestMethodWorker.java:128)
      at java.base/java.util.ArrayList.forEach(ArrayList.java:1511)
      at org.testng.TestRunner.privateRun(TestRunner.java:794)
      at org.testng.TestRunner.run(TestRunner.java:596)
      at org.testng.SuiteRunner.runTest(SuiteRunner.java:377)
      at org.testng.SuiteRunner.runSequentially(SuiteRunner.java:371)
      at org.testng.SuiteRunner.privateRun(SuiteRunner.java:332)
      at org.testng.SuiteRunner.run(SuiteRunner.java:276)
      at org.testng.SuiteRunnerWorker.runSuite(SuiteRunnerWorker.java:53)
      at org.testng.SuiteRunnerWorker.run(SuiteRunnerWorker.java:96)
      at org.testng.TestNG.runSuitesSequentially(TestNG.java:1212)
      at org.testng.TestNG.runSuitesLocally(TestNG.java:1134)
      at org.testng.TestNG.runSuites(TestNG.java:1063)
      at org.testng.TestNG.run(TestNG.java:1031)
      at com.sun.javatest.regtest.agent.TestNGRunner.main(TestNGRunner.java:94)
      at com.sun.javatest.regtest.agent.TestNGRunner.main(TestNGRunner.java:54)
      at java.base/jdk.internal.reflect.NativeMethodAccessorImpl.invoke0(Native Method)
      at java.base/jdk.internal.reflect.NativeMethodAccessorImpl.invoke(NativeMethodAccessorImpl.java:78)
      at java.base/jdk.internal.reflect.DelegatingMethodAccessorImpl.invoke(DelegatingMethodAccessorImpl.java:43)
      at java.base/java.lang.reflect.Method.invoke(Method.java:568)
      at com.sun.javatest.regtest.agent.MainWrapper$MainThread.run(MainWrapper.java:127)
      at java.base/java.lang.Thread.run(Thread.java:831)
      test RuleBasedCollatorTest.testNormalization("?", "?", 1, -1): failure
      java.lang.NullPointerException: Cannot invoke "java.text.RuleBasedCollator.clone()" because "RuleBasedCollatorTest.USC" is null
      at RuleBasedCollatorTest.testNormalization(RuleBasedCollatorTest.java:168)
      at java.base/jdk.internal.reflect.NativeMethodAccessorImpl.invoke0(Native Method)
      at java.base/jdk.internal.reflect.NativeMethodAccessorImpl.invoke(NativeMethodAccessorImpl.java:78)
      at java.base/jdk.internal.reflect.DelegatingMethodAccessorImpl.invoke(DelegatingMethodAccessorImpl.java:43)
      at java.base/java.lang.reflect.Method.invoke(Method.java:568)
      at org.testng.internal.MethodInvocationHelper.invokeMethod(MethodInvocationHelper.java:133)
      at org.testng.internal.TestInvoker.invokeMethod(TestInvoker.java:598)
      at org.testng.internal.TestInvoker.invokeTestMethod(TestInvoker.java:173)
      at org.testng.internal.MethodRunner.runInSequence(MethodRunner.java:46)
      at org.testng.internal.TestInvoker$MethodInvocationAgent.invoke(TestInvoker.java:824)
      at org.testng.internal.TestInvoker.invokeTestMethods(TestInvoker.java:146)
      at org.testng.internal.TestMethodWorker.invokeTestMethods(TestMethodWorker.java:146)
      at org.testng.internal.TestMethodWorker.run(TestMethodWorker.java:128)
      at java.base/java.util.ArrayList.forEach(ArrayList.java:1511)
      at org.testng.TestRunner.privateRun(TestRunner.java:794)
      at org.testng.TestRunner.run(TestRunner.java:596)
      at org.testng.SuiteRunner.runTest(SuiteRunner.java:377)
      at org.testng.SuiteRunner.runSequentially(SuiteRunner.java:371)
      at org.testng.SuiteRunner.privateRun(SuiteRunner.java:332)
      at org.testng.SuiteRunner.run(SuiteRunner.java:276)
      at org.testng.SuiteRunnerWorker.runSuite(SuiteRunnerWorker.java:53)
      at org.testng.SuiteRunnerWorker.run(SuiteRunnerWorker.java:96)
      at org.testng.TestNG.runSuitesSequentially(TestNG.java:1212)
      at org.testng.TestNG.runSuitesLocally(TestNG.java:1134)
      at org.testng.TestNG.runSuites(TestNG.java:1063)
      at org.testng.TestNG.run(TestNG.java:1031)
      at com.sun.javatest.regtest.agent.TestNGRunner.main(TestNGRunner.java:94)
      at com.sun.javatest.regtest.agent.TestNGRunner.main(TestNGRunner.java:54)
      at java.base/jdk.internal.reflect.NativeMethodAccessorImpl.invoke0(Native Method)
      at java.base/jdk.internal.reflect.NativeMethodAccessorImpl.invoke(NativeMethodAccessorImpl.java:78)
      at java.base/jdk.internal.reflect.DelegatingMethodAccessorImpl.invoke(DelegatingMethodAccessorImpl.java:43)
      at java.base/java.lang.reflect.Method.invoke(Method.java:568)
      at com.sun.javatest.regtest.agent.MainWrapper$MainThread.run(MainWrapper.java:127)
      at java.base/java.lang.Thread.run(Thread.java:831)
      test RuleBasedCollatorTest.testNormalization("?", "?", 2, 0): failure
      java.lang.NullPointerException: Cannot invoke "java.text.RuleBasedCollator.clone()" because "RuleBasedCollatorTest.USC" is null
      at RuleBasedCollatorTest.testNormalization(RuleBasedCollatorTest.java:168)
      at java.base/jdk.internal.reflect.NativeMethodAccessorImpl.invoke0(Native Method)
      at java.base/jdk.internal.reflect.NativeMethodAccessorImpl.invoke(NativeMethodAccessorImpl.java:78)
      at java.base/jdk.internal.reflect.DelegatingMethodAccessorImpl.invoke(DelegatingMethodAccessorImpl.java:43)
      at java.base/java.lang.reflect.Method.invoke(Method.java:568)
      at org.testng.internal.MethodInvocationHelper.invokeMethod(MethodInvocationHelper.java:133)
      at org.testng.internal.TestInvoker.invokeMethod(TestInvoker.java:598)
      at org.testng.internal.TestInvoker.invokeTestMethod(TestInvoker.java:173)
      at org.testng.internal.MethodRunner.runInSequence(MethodRunner.java:46)
      at org.testng.internal.TestInvoker$MethodInvocationAgent.invoke(TestInvoker.java:824)
      at org.testng.internal.TestInvoker.invokeTestMethods(TestInvoker.java:146)
      at org.testng.internal.TestMethodWorker.invokeTestMethods(TestMethodWorker.java:146)
      at org.testng.internal.TestMethodWorker.run(TestMethodWorker.java:128)
      at java.base/java.util.ArrayList.forEach(ArrayList.java:1511)
      at org.testng.TestRunner.privateRun(TestRunner.java:794)
      at org.testng.TestRunner.run(TestRunner.java:596)
      at org.testng.SuiteRunner.runTest(SuiteRunner.java:377)
      at org.testng.SuiteRunner.runSequentially(SuiteRunner.java:371)
      at org.testng.SuiteRunner.privateRun(SuiteRunner.java:332)
      at org.testng.SuiteRunner.run(SuiteRunner.java:276)
      at org.testng.SuiteRunnerWorker.runSuite(SuiteRunnerWorker.java:53)
      at org.testng.SuiteRunnerWorker.run(SuiteRunnerWorker.java:96)
      at org.testng.TestNG.runSuitesSequentially(TestNG.java:1212)
      at org.testng.TestNG.runSuitesLocally(TestNG.java:1134)
      at org.testng.TestNG.runSuites(TestNG.java:1063)
      at org.testng.TestNG.run(TestNG.java:1031)
      at com.sun.javatest.regtest.agent.TestNGRunner.main(TestNGRunner.java:94)
      at com.sun.javatest.regtest.agent.TestNGRunner.main(TestNGRunner.java:54)
      at java.base/jdk.internal.reflect.NativeMethodAccessorImpl.invoke0(Native Method)
      at java.base/jdk.internal.reflect.NativeMethodAccessorImpl.invoke(NativeMethodAccessorImpl.java:78)
      at java.base/jdk.internal.reflect.DelegatingMethodAccessorImpl.invoke(DelegatingMethodAccessorImpl.java:43)
      at java.base/java.lang.reflect.Method.invoke(Method.java:568)
      at com.sun.javatest.regtest.agent.MainWrapper$MainThread.run(MainWrapper.java:127)
      at java.base/java.lang.Thread.run(Thread.java:831)
      test RuleBasedCollatorTest.testNullParseException(): success
      test RuleBasedCollatorTest.testParseException(""): success
      test RuleBasedCollatorTest.testParseException("a < b"): success
      test RuleBasedCollatorTest.testParseException("< a-b < c"): success
      test RuleBasedCollatorTest.testParseException("< ,a"): success
      test RuleBasedCollatorTest.testParseException("< a < b & c < d"): success
      test RuleBasedCollatorTest.testRules("< b=c<?;A,a", [Ljava.lang.String;@16fee85c, [Ljava.lang.String;@297e7183): success
      test RuleBasedCollatorTest.testRules("null& b < ch ,cH, Ch, CH < c ", [Ljava.lang.String;@76b7453c, [Ljava.lang.String;@2c9fd000): failure
      java.text.ParseException: missing char (=,;<&) : null& b <
      at java.base/java.text.PatternEntry$Parser.next(PatternEntry.java:254)
      at java.base/java.text.MergeCollation.addPattern(MergeCollation.java:180)
      at java.base/java.text.MergeCollation.setPattern(MergeCollation.java:166)
      at java.base/java.text.MergeCollation.<init>(MergeCollation.java:73)
      at java.base/java.text.RBTableBuilder.build(RBTableBuilder.java:113)
      at java.base/java.text.RBCollationTables.<init>(RBCollationTables.java:83)
      at java.base/java.text.RuleBasedCollator.<init>(RuleBasedCollator.java:301)
      at java.base/java.text.RuleBasedCollator.<init>(RuleBasedCollator.java:282)
      at RuleBasedCollatorTest.testRules(RuleBasedCollatorTest.java:97)
      at java.base/jdk.internal.reflect.NativeMethodAccessorImpl.invoke0(Native Method)
      at java.base/jdk.internal.reflect.NativeMethodAccessorImpl.invoke(NativeMethodAccessorImpl.java:78)
      at java.base/jdk.internal.reflect.DelegatingMethodAccessorImpl.invoke(DelegatingMethodAccessorImpl.java:43)
      at java.base/java.lang.reflect.Method.invoke(Method.java:568)
      at org.testng.internal.MethodInvocationHelper.invokeMethod(MethodInvocationHelper.java:133)
      at org.testng.internal.TestInvoker.invokeMethod(TestInvoker.java:598)
      at org.testng.internal.TestInvoker.invokeTestMethod(TestInvoker.java:173)
      at org.testng.internal.MethodRunner.runInSequence(MethodRunner.java:46)
      at org.testng.internal.TestInvoker$MethodInvocationAgent.invoke(TestInvoker.java:824)
      at org.testng.internal.TestInvoker.invokeTestMethods(TestInvoker.java:146)
      at org.testng.internal.TestMethodWorker.invokeTestMethods(TestMethodWorker.java:146)
      at org.testng.internal.TestMethodWorker.run(TestMethodWorker.java:128)
      at java.base/java.util.ArrayList.forEach(ArrayList.java:1511)
      at org.testng.TestRunner.privateRun(TestRunner.java:794)
      at org.testng.TestRunner.run(TestRunner.java:596)
      at org.testng.SuiteRunner.runTest(SuiteRunner.java:377)
      at org.testng.SuiteRunner.runSequentially(SuiteRunner.java:371)
      at org.testng.SuiteRunner.privateRun(SuiteRunner.java:332)
      at org.testng.SuiteRunner.run(SuiteRunner.java:276)
      at org.testng.SuiteRunnerWorker.runSuite(SuiteRunnerWorker.java:53)
      at org.testng.SuiteRunnerWorker.run(SuiteRunnerWorker.java:96)
      at org.testng.TestNG.runSuitesSequentially(TestNG.java:1212)
      at org.testng.TestNG.runSuitesLocally(TestNG.java:1134)
      at org.testng.TestNG.runSuites(TestNG.java:1063)
      at org.testng.TestNG.run(TestNG.java:1031)
      at com.sun.javatest.regtest.agent.TestNGRunner.main(TestNGRunner.java:94)
      at com.sun.javatest.regtest.agent.TestNGRunner.main(TestNGRunner.java:54)
      at java.base/jdk.internal.reflect.NativeMethodAccessorImpl.invoke0(Native Method)
      at java.base/jdk.internal.reflect.NativeMethodAccessorImpl.invoke(NativeMethodAccessorImpl.java:78)
      at java.base/jdk.internal.reflect.DelegatingMethodAccessorImpl.invoke(DelegatingMethodAccessorImpl.java:43)
      at java.base/java.lang.reflect.Method.invoke(Method.java:568)
      at com.sun.javatest.regtest.agent.MainWrapper$MainThread.run(MainWrapper.java:127)
      at java.base/java.lang.Thread.run(Thread.java:831)
      test RuleBasedCollatorTest.testRules("null& ae = ? < b", [Ljava.lang.String;@7aaa3e54, [Ljava.lang.String;@414042fa): failure
      java.text.ParseException: missing char (=,;<&) : null& ae =
      at java.base/java.text.PatternEntry$Parser.next(PatternEntry.java:254)
      at java.base/java.text.MergeCollation.addPattern(MergeCollation.java:180)
      at java.base/java.text.MergeCollation.setPattern(MergeCollation.java:166)
      at java.base/java.text.MergeCollation.<init>(MergeCollation.java:73)
      at java.base/java.text.RBTableBuilder.build(RBTableBuilder.java:113)
      at java.base/java.text.RBCollationTables.<init>(RBCollationTables.java:83)
      at java.base/java.text.RuleBasedCollator.<init>(RuleBasedCollator.java:301)
      at java.base/java.text.RuleBasedCollator.<init>(RuleBasedCollator.java:282)
      at RuleBasedCollatorTest.testRules(RuleBasedCollatorTest.java:97)
      at java.base/jdk.internal.reflect.NativeMethodAccessorImpl.invoke0(Native Method)
      at java.base/jdk.internal.reflect.NativeMethodAccessorImpl.invoke(NativeMethodAccessorImpl.java:78)
      at java.base/jdk.internal.reflect.DelegatingMethodAccessorImpl.invoke(DelegatingMethodAccessorImpl.java:43)
      at java.base/java.lang.reflect.Method.invoke(Method.java:568)
      at org.testng.internal.MethodInvocationHelper.invokeMethod(MethodInvocationHelper.java:133)
      at org.testng.internal.TestInvoker.invokeMethod(TestInvoker.java:598)
      at org.testng.internal.TestInvoker.invokeTestMethod(TestInvoker.java:173)
      at org.testng.internal.MethodRunner.runInSequence(MethodRunner.java:46)
      at org.testng.internal.TestInvoker$MethodInvocationAgent.invoke(TestInvoker.java:824)
      at org.testng.internal.TestInvoker.invokeTestMethods(TestInvoker.java:146)
      at org.testng.internal.TestMethodWorker.invokeTestMethods(TestMethodWorker.java:146)
      at org.testng.internal.TestMethodWorker.run(TestMethodWorker.java:128)
      at java.base/java.util.ArrayList.forEach(ArrayList.java:1511)
      at org.testng.TestRunner.privateRun(TestRunner.java:794)
      at org.testng.TestRunner.run(TestRunner.java:596)
      at org.testng.SuiteRunner.runTest(SuiteRunner.java:377)
      at org.testng.SuiteRunner.runSequentially(SuiteRunner.java:371)
      at org.testng.SuiteRunner.privateRun(SuiteRunner.java:332)
      at org.testng.SuiteRunner.run(SuiteRunner.java:276)
      at org.testng.SuiteRunnerWorker.runSuite(SuiteRunnerWorker.java:53)
      at org.testng.SuiteRunnerWorker.run(SuiteRunnerWorker.java:96)
      at org.testng.TestNG.runSuitesSequentially(TestNG.java:1212)
      at org.testng.TestNG.runSuitesLocally(TestNG.java:1134)
      at org.testng.TestNG.runSuites(TestNG.java:1063)
      at org.testng.TestNG.run(TestNG.java:1031)
      at com.sun.javatest.regtest.agent.TestNGRunner.main(TestNGRunner.java:94)
      at com.sun.javatest.regtest.agent.TestNGRunner.main(TestNGRunner.java:54)
      at java.base/jdk.internal.reflect.NativeMethodAccessorImpl.invoke0(Native Method)
      at java.base/jdk.internal.reflect.NativeMethodAccessorImpl.invoke(NativeMethodAccessorImpl.java:78)
      at java.base/jdk.internal.reflect.DelegatingMethodAccessorImpl.invoke(DelegatingMethodAccessorImpl.java:43)
      at java.base/java.lang.reflect.Method.invoke(Method.java:568)
      at com.sun.javatest.regtest.agent.MainWrapper$MainThread.run(MainWrapper.java:127)
      at java.base/java.lang.Thread.run(Thread.java:831)
      test RuleBasedCollatorTest.testRules("null< ' ' < '-'", [Ljava.lang.String;@37042bb2, [Ljava.lang.String;@7490e83a): failure
      java.text.ParseException: missing char (=,;<&) : null< ' '
      at java.base/java.text.PatternEntry$Parser.next(PatternEntry.java:254)
      at java.base/java.text.MergeCollation.addPattern(MergeCollation.java:180)
      at java.base/java.text.MergeCollation.setPattern(MergeCollation.java:166)
      at java.base/java.text.MergeCollation.<init>(MergeCollation.java:73)
      at java.base/java.text.RBTableBuilder.build(RBTableBuilder.java:113)
      at java.base/java.text.RBCollationTables.<init>(RBCollationTables.java:83)
      at java.base/java.text.RuleBasedCollator.<init>(RuleBasedCollator.java:301)
      at java.base/java.text.RuleBasedCollator.<init>(RuleBasedCollator.java:282)
      at RuleBasedCollatorTest.testRules(RuleBasedCollatorTest.java:97)
      at java.base/jdk.internal.reflect.NativeMethodAccessorImpl.invoke0(Native Method)
      at java.base/jdk.internal.reflect.NativeMethodAccessorImpl.invoke(NativeMethodAccessorImpl.java:78)
      at java.base/jdk.internal.reflect.DelegatingMethodAccessorImpl.invoke(DelegatingMethodAccessorImpl.java:43)
      at java.base/java.lang.reflect.Method.invoke(Method.java:568)
      at org.testng.internal.MethodInvocationHelper.invokeMethod(MethodInvocationHelper.java:133)
      at org.testng.internal.TestInvoker.invokeMethod(TestInvoker.java:598)
      at org.testng.internal.TestInvoker.invokeTestMethod(TestInvoker.java:173)
      at org.testng.internal.MethodRunner.runInSequence(MethodRunner.java:46)
      at org.testng.internal.TestInvoker$MethodInvocationAgent.invoke(TestInvoker.java:824)
      at org.testng.internal.TestInvoker.invokeTestMethods(TestInvoker.java:146)
      at org.testng.internal.TestMethodWorker.invokeTestMethods(TestMethodWorker.java:146)
      at org.testng.internal.TestMethodWorker.run(TestMethodWorker.java:128)
      at java.base/java.util.ArrayList.forEach(ArrayList.java:1511)
      at org.testng.TestRunner.privateRun(TestRunner.java:794)
      at org.testng.TestRunner.run(TestRunner.java:596)
      at org.testng.SuiteRunner.runTest(SuiteRunner.java:377)
      at org.testng.SuiteRunner.runSequentially(SuiteRunner.java:371)
      at org.testng.SuiteRunner.privateRun(SuiteRunner.java:332)
      at org.testng.SuiteRunner.run(SuiteRunner.java:276)
      at org.testng.SuiteRunnerWorker.runSuite(SuiteRunnerWorker.java:53)
      at org.testng.SuiteRunnerWorker.run(SuiteRunnerWorker.java:96)
      at org.testng.TestNG.runSuitesSequentially(TestNG.java:1212)
      at org.testng.TestNG.runSuitesLocally(TestNG.java:1134)
      at org.testng.TestNG.runSuites(TestNG.java:1063)
      at org.testng.TestNG.run(TestNG.java:1031)
      at com.sun.javatest.regtest.agent.TestNGRunner.main(TestNGRunner.java:94)
      at com.sun.javatest.regtest.agent.TestNGRunner.main(TestNGRunner.java:54)
      at java.base/jdk.internal.reflect.NativeMethodAccessorImpl.invoke0(Native Method)
      at java.base/jdk.internal.reflect.NativeMethodAccessorImpl.invoke(NativeMethodAccessorImpl.java:78)
      at java.base/jdk.internal.reflect.DelegatingMethodAccessorImpl.invoke(DelegatingMethodAccessorImpl.java:43)
      at java.base/java.lang.reflect.Method.invoke(Method.java:568)
      at com.sun.javatest.regtest.agent.MainWrapper$MainThread.run(MainWrapper.java:127)
      at java.base/java.lang.Thread.run(Thread.java:831)
      test RuleBasedCollatorTest.testThaiLaoVowelConsonantSwapping("??", "??", -1): failure
      java.text.ParseException: missing char (=,;<&) : null& Z <
      at java.base/java.text.PatternEntry$Parser.next(PatternEntry.java:254)
      at java.base/java.text.MergeCollation.addPattern(MergeCollation.java:180)
      at java.base/java.text.MergeCollation.setPattern(MergeCollation.java:166)
      at java.base/java.text.MergeCollation.<init>(MergeCollation.java:73)
      at java.base/java.text.RBTableBuilder.build(RBTableBuilder.java:113)
      at java.base/java.text.RBCollationTables.<init>(RBCollationTables.java:83)
      at java.base/java.text.RuleBasedCollator.<init>(RuleBasedCollator.java:301)
      at java.base/java.text.RuleBasedCollator.<init>(RuleBasedCollator.java:282)
      at RuleBasedCollatorTest.testThaiLaoVowelConsonantSwapping(RuleBasedCollatorTest.java:137)
      at java.base/jdk.internal.reflect.NativeMethodAccessorImpl.invoke0(Native Method)
      at java.base/jdk.internal.reflect.NativeMethodAccessorImpl.invoke(NativeMethodAccessorImpl.java:78)
      at java.base/jdk.internal.reflect.DelegatingMethodAccessorImpl.invoke(DelegatingMethodAccessorImpl.java:43)
      at java.base/java.lang.reflect.Method.invoke(Method.java:568)
      at org.testng.internal.MethodInvocationHelper.invokeMethod(MethodInvocationHelper.java:133)
      at org.testng.internal.TestInvoker.invokeMethod(TestInvoker.java:598)
      at org.testng.internal.TestInvoker.invokeTestMethod(TestInvoker.java:173)
      at org.testng.internal.MethodRunner.runInSequence(MethodRunner.java:46)
      at org.testng.internal.TestInvoker$MethodInvocationAgent.invoke(TestInvoker.java:824)
      at org.testng.internal.TestInvoker.invokeTestMethods(TestInvoker.java:146)
      at org.testng.internal.TestMethodWorker.invokeTestMethods(TestMethodWorker.java:146)
      at org.testng.internal.TestMethodWorker.run(TestMethodWorker.java:128)
      at java.base/java.util.ArrayList.forEach(ArrayList.java:1511)
      at org.testng.TestRunner.privateRun(TestRunner.java:794)
      at org.testng.TestRunner.run(TestRunner.java:596)
      at org.testng.SuiteRunner.runTest(SuiteRunner.java:377)
      at org.testng.SuiteRunner.runSequentially(SuiteRunner.java:371)
      at org.testng.SuiteRunner.privateRun(SuiteRunner.java:332)
      at org.testng.SuiteRunner.run(SuiteRunner.java:276)
      at org.testng.SuiteRunnerWorker.runSuite(SuiteRunnerWorker.java:53)
      at org.testng.SuiteRunnerWorker.run(SuiteRunnerWorker.java:96)
      at org.testng.TestNG.runSuitesSequentially(TestNG.java:1212)
      at org.testng.TestNG.runSuitesLocally(TestNG.java:1134)
      at org.testng.TestNG.runSuites(TestNG.java:1063)
      at org.testng.TestNG.run(TestNG.java:1031)
      at com.sun.javatest.regtest.agent.TestNGRunner.main(TestNGRunner.java:94)
      at com.sun.javatest.regtest.agent.TestNGRunner.main(TestNGRunner.java:54)
      at java.base/jdk.internal.reflect.NativeMethodAccessorImpl.invoke0(Native Method)
      at java.base/jdk.internal.reflect.NativeMethodAccessorImpl.invoke(NativeMethodAccessorImpl.java:78)
      at java.base/jdk.internal.reflect.DelegatingMethodAccessorImpl.invoke(DelegatingMethodAccessorImpl.java:43)
      at java.base/java.lang.reflect.Method.invoke(Method.java:568)
      at com.sun.javatest.regtest.agent.MainWrapper$MainThread.run(MainWrapper.java:127)
      at java.base/java.lang.Thread.run(Thread.java:831)
      test RuleBasedCollatorTest.testThaiLaoVowelConsonantSwapping("??", "??", 1): failure
      java.text.ParseException: missing char (=,;<&) : null& Z <
      at java.base/java.text.PatternEntry$Parser.next(PatternEntry.java:254)
      at java.base/java.text.MergeCollation.addPattern(MergeCollation.java:180)
      at java.base/java.text.MergeCollation.setPattern(MergeCollation.java:166)
      at java.base/java.text.MergeCollation.<init>(MergeCollation.java:73)
      at java.base/java.text.RBTableBuilder.build(RBTableBuilder.java:113)
      at java.base/java.text.RBCollationTables.<init>(RBCollationTables.java:83)
      at java.base/java.text.RuleBasedCollator.<init>(RuleBasedCollator.java:301)
      at java.base/java.text.RuleBasedCollator.<init>(RuleBasedCollator.java:282)
      at RuleBasedCollatorTest.testThaiLaoVowelConsonantSwapping(RuleBasedCollatorTest.java:137)
      at java.base/jdk.internal.reflect.NativeMethodAccessorImpl.invoke0(Native Method)
      at java.base/jdk.internal.reflect.NativeMethodAccessorImpl.invoke(NativeMethodAccessorImpl.java:78)
      at java.base/jdk.internal.reflect.DelegatingMethodAccessorImpl.invoke(DelegatingMethodAccessorImpl.java:43)
      at java.base/java.lang.reflect.Method.invoke(Method.java:568)
      at org.testng.internal.MethodInvocationHelper.invokeMethod(MethodInvocationHelper.java:133)
      at org.testng.internal.TestInvoker.invokeMethod(TestInvoker.java:598)
      at org.testng.internal.TestInvoker.invokeTestMethod(TestInvoker.java:173)
      at org.testng.internal.MethodRunner.runInSequence(MethodRunner.java:46)
      at org.testng.internal.TestInvoker$MethodInvocationAgent.invoke(TestInvoker.java:824)
      at org.testng.internal.TestInvoker.invokeTestMethods(TestInvoker.java:146)
      at org.testng.internal.TestMethodWorker.invokeTestMethods(TestMethodWorker.java:146)
      at org.testng.internal.TestMethodWorker.run(TestMethodWorker.java:128)
      at java.base/java.util.ArrayList.forEach(ArrayList.java:1511)
      at org.testng.TestRunner.privateRun(TestRunner.java:794)
      at org.testng.TestRunner.run(TestRunner.java:596)
      at org.testng.SuiteRunner.runTest(SuiteRunner.java:377)
      at org.testng.SuiteRunner.runSequentially(SuiteRunner.java:371)
      at org.testng.SuiteRunner.privateRun(SuiteRunner.java:332)
      at org.testng.SuiteRunner.run(SuiteRunner.java:276)
      at org.testng.SuiteRunnerWorker.runSuite(SuiteRunnerWorker.java:53)
      at org.testng.SuiteRunnerWorker.run(SuiteRunnerWorker.java:96)
      at org.testng.TestNG.runSuitesSequentially(TestNG.java:1212)
      at org.testng.TestNG.runSuitesLocally(TestNG.java:1134)
      at org.testng.TestNG.runSuites(TestNG.java:1063)
      at org.testng.TestNG.run(TestNG.java:1031)
      at com.sun.javatest.regtest.agent.TestNGRunner.main(TestNGRunner.java:94)
      at com.sun.javatest.regtest.agent.TestNGRunner.main(TestNGRunner.java:54)
      at java.base/jdk.internal.reflect.NativeMethodAccessorImpl.invoke0(Native Method)
      at java.base/jdk.internal.reflect.NativeMethodAccessorImpl.invoke(NativeMethodAccessorImpl.java:78)
      at java.base/jdk.internal.reflect.DelegatingMethodAccessorImpl.invoke(DelegatingMethodAccessorImpl.java:43)
      at java.base/java.lang.reflect.Method.invoke(Method.java:568)
      at com.sun.javatest.regtest.agent.MainWrapper$MainThread.run(MainWrapper.java:127)
      at java.base/java.lang.Thread.run(Thread.java:831)
      test RuleBasedCollatorTest.testThaiLaoVowelConsonantSwapping("?a", "??", 1): failure
      java.text.ParseException: missing char (=,;<&) : null& Z <
      at java.base/java.text.PatternEntry$Parser.next(PatternEntry.java:254)
      at java.base/java.text.MergeCollation.addPattern(MergeCollation.java:180)
      at java.base/java.text.MergeCollation.setPattern(MergeCollation.java:166)
      at java.base/java.text.MergeCollation.<init>(MergeCollation.java:73)
      at java.base/java.text.RBTableBuilder.build(RBTableBuilder.java:113)
      at java.base/java.text.RBCollationTables.<init>(RBCollationTables.java:83)
      at java.base/java.text.RuleBasedCollator.<init>(RuleBasedCollator.java:301)
      at java.base/java.text.RuleBasedCollator.<init>(RuleBasedCollator.java:282)
      at RuleBasedCollatorTest.testThaiLaoVowelConsonantSwapping(RuleBasedCollatorTest.java:137)
      at java.base/jdk.internal.reflect.NativeMethodAccessorImpl.invoke0(Native Method)
      at java.base/jdk.internal.reflect.NativeMethodAccessorImpl.invoke(NativeMethodAccessorImpl.java:78)
      at java.base/jdk.internal.reflect.DelegatingMethodAccessorImpl.invoke(DelegatingMethodAccessorImpl.java:43)
      at java.base/java.lang.reflect.Method.invoke(Method.java:568)
      at org.testng.internal.MethodInvocationHelper.invokeMethod(MethodInvocationHelper.java:133)
      at org.testng.internal.TestInvoker.invokeMethod(TestInvoker.java:598)
      at org.testng.internal.TestInvoker.invokeTestMethod(TestInvoker.java:173)
      at org.testng.internal.MethodRunner.runInSequence(MethodRunner.java:46)
      at org.testng.internal.TestInvoker$MethodInvocationAgent.invoke(TestInvoker.java:824)
      at org.testng.internal.TestInvoker.invokeTestMethods(TestInvoker.java:146)
      at org.testng.internal.TestMethodWorker.invokeTestMethods(TestMethodWorker.java:146)
      at org.testng.internal.TestMethodWorker.run(TestMethodWorker.java:128)
      at java.base/java.util.ArrayList.forEach(ArrayList.java:1511)
      at org.testng.TestRunner.privateRun(TestRunner.java:794)
      at org.testng.TestRunner.run(TestRunner.java:596)
      at org.testng.SuiteRunner.runTest(SuiteRunner.java:377)
      at org.testng.SuiteRunner.runSequentially(SuiteRunner.java:371)
      at org.testng.SuiteRunner.privateRun(SuiteRunner.java:332)
      at org.testng.SuiteRunner.run(SuiteRunner.java:276)
      at org.testng.SuiteRunnerWorker.runSuite(SuiteRunnerWorker.java:53)
      at org.testng.SuiteRunnerWorker.run(SuiteRunnerWorker.java:96)
      at org.testng.TestNG.runSuitesSequentially(TestNG.java:1212)
      at org.testng.TestNG.runSuitesLocally(TestNG.java:1134)
      at org.testng.TestNG.runSuites(TestNG.java:1063)
      at org.testng.TestNG.run(TestNG.java:1031)
      at com.sun.javatest.regtest.agent.TestNGRunner.main(TestNGRunner.java:94)
      at com.sun.javatest.regtest.agent.TestNGRunner.main(TestNGRunner.java:54)
      at java.base/jdk.internal.reflect.NativeMethodAccessorImpl.invoke0(Native Method)
      at java.base/jdk.internal.reflect.NativeMethodAccessorImpl.invoke(NativeMethodAccessorImpl.java:78)
      at java.base/jdk.internal.reflect.DelegatingMethodAccessorImpl.invoke(DelegatingMethodAccessorImpl.java:43)
      at java.base/java.lang.reflect.Method.invoke(Method.java:568)
      at com.sun.javatest.regtest.agent.MainWrapper$MainThread.run(MainWrapper.java:127)
      at java.base/java.lang.Thread.run(Thread.java:831)

      ===============================================
      java/text/Collator/RuleBasedCollatorTest.java
      Total tests run: 24, Passes: 10, Failures: 14, Skips: 0
      ===============================================


        Attachments

          Issue Links

            Activity

              People

              Assignee:
              naoto Naoto Sato
              Reporter:
              jjg Jonathan Gibbons
              Votes:
              0 Vote for this issue
              Watchers:
              5 Start watching this issue

                Dates

                Created:
                Updated:
                Resolved: