Uploaded image for project: 'JDK'
  1. JDK
  2. JDK-8268138

docs build error after JDK-8263332 integration

    XMLWordPrintable

    Details

    • Type: Bug
    • Status: Resolved
    • Priority: P1
    • Resolution: Fixed
    • Affects Version/s: 17
    • Fix Version/s: 17
    • Component/s: hotspot
    • Labels:
    • Subcomponent:
      jfr
    • Resolved In Build:
      b26

      Description

      [2021-06-02T17:48:01,613Z] Generating JDK_API javadoc for 60 modules
      [2021-06-02T17:48:39,148Z] /opt/mach5/mesos/work_dir/slaves/3c846bae-ce30-4a97-93ee-9fef4497ccb6-S79032/frameworks/1735e8a2-a1db-478c-8104-60c8b0af87dd-0196/executors/477a0a91-f6bf-424c-b1b8-4c56e20e6545/runs/7412e478-39b3-4c85-983f-c1c6544c9709/workspace/open/src/jdk.jfr/share/classes/jdk/jfr/consumer/RecordingStream.java:426: error: reference not found
      [2021-06-02T17:48:39,148Z] * @see RecordingStream#setMaxSize(Duration)
      [2021-06-02T17:48:39,148Z] ^
      [2021-06-02T17:48:39,336Z] /opt/mach5/mesos/work_dir/slaves/3c846bae-ce30-4a97-93ee-9fef4497ccb6-S79032/frameworks/1735e8a2-a1db-478c-8104-60c8b0af87dd-0196/executors/477a0a91-f6bf-424c-b1b8-4c56e20e6545/runs/7412e478-39b3-4c85-983f-c1c6544c9709/workspace/open/src/jdk.management.jfr/share/classes/jdk/management/jfr/RemoteRecordingStream.java:585: error: reference not found
      [2021-06-02T17:48:39,336Z] * @see RemoteRecordingStream#setMaxSize(Duration)
      [2021-06-02T17:48:39,336Z] ^
      [2021-06-02T17:48:55,259Z] Creating javase-17-ea+25_linux-x64_doc-api-spec.tar.gz
      [2021-06-02T17:48:55,885Z] Creating jdk-reference-17-ea+25_linux-x64_doc-api-spec.tar.gz
      [2021-06-02T17:49:00,305Z] 2 errors
      [2021-06-02T17:49:00,417Z] gmake[3]: *** [/opt/mach5/mesos/work_dir/slaves/3c846bae-ce30-4a97-93ee-9fef4497ccb6-S79032/frameworks/1735e8a2-a1db-478c-8104-60c8b0af87dd-0196/executors/477a0a91-f6bf-424c-b1b8-4c56e20e6545/runs/7412e478-39b3-4c85-983f-c1c6544c9709/workspace/build/docs/support/docs/_javadoc_JDK_API_exec.marker] Error 1
      [2021-06-02T17:49:00,484Z] gmake[2]: *** [docs-jdk-api-javadoc] Error 1
      [2021-06-02T17:49:00,484Z] gmake[2]: *** Waiting for unfinished jobs....
      [2021-06-02T17:49:01,644Z]
      [2021-06-02T17:49:01,644Z] ERROR: Build failed for target 'default (all-docs-bundles)' in configuration 'docs' (exit code 2)
      [2021-06-02T17:49:01,652Z] Stopping sjavac server

        Attachments

          Issue Links

            Activity

              People

              Assignee:
              egahlin Erik Gahlin
              Reporter:
              dcubed Daniel Daugherty
              Votes:
              0 Vote for this issue
              Watchers:
              4 Start watching this issue

                Dates

                Created:
                Updated:
                Resolved: