Uploaded image for project: 'JDK'
  1. JDK
  2. JDK-8268714

[macos-aarch64] 7 java/net/httpclient/websocket tests failed

    XMLWordPrintable

    Details

    • Subcomponent:
    • Resolved In Build:
      b28
    • CPU:
      aarch64
    • OS:
      os_x

      Backports

        Description

        The following tests failed in the JDK17 CI:

        java/net/httpclient/websocket/WSHandshakeExceptionTest.java
        java/net/httpclient/websocket/PendingTextPongClose.java
        java/net/httpclient/websocket/PendingTextPingClose.java
        java/net/httpclient/websocket/PendingPongBinaryClose.java
        java/net/httpclient/websocket/PendingPongTextClose.java
        java/net/httpclient/websocket/PendingPingTextClose.java
        java/net/httpclient/websocket/PendingBinaryPongClose.java


        Here's a snippet from the WSHandshakeExceptionTest.java log file:

        Response is <h1>404 Not Found</h1>No context found for request
        test WSHandshakeExceptionTest.test("ws://localhost:59319/", false): success
        iteration 0
        test WSHandshakeExceptionTest.test("wss://localhost:59320/", false): failure
        java.lang.AssertionError: Unexpected exception
        at WSHandshakeExceptionTest.test(WSHandshakeExceptionTest.java:123)
        at java.base/jdk.internal.reflect.NativeMethodAccessorImpl.invoke0(Native Method)
        at java.base/jdk.internal.reflect.NativeMethodAccessorImpl.invoke(NativeMethodAccessorImpl.java:77)
        at java.base/jdk.internal.reflect.DelegatingMethodAccessorImpl.invoke(DelegatingMethodAccessorImpl.java:43)
        at java.base/java.lang.reflect.Method.invoke(Method.java:568)
        at org.testng.internal.MethodInvocationHelper.invokeMethod(MethodInvocationHelper.java:132)
        at org.testng.internal.TestInvoker.invokeMethod(TestInvoker.java:599)
        at org.testng.internal.TestInvoker.invokeTestMethod(TestInvoker.java:174)
        at org.testng.internal.MethodRunner.runInSequence(MethodRunner.java:46)
        at org.testng.internal.TestInvoker$MethodInvocationAgent.invoke(TestInvoker.java:822)
        at org.testng.internal.TestInvoker.invokeTestMethods(TestInvoker.java:147)
        at org.testng.internal.TestMethodWorker.invokeTestMethods(TestMethodWorker.java:146)
        at org.testng.internal.TestMethodWorker.run(TestMethodWorker.java:128)
        at java.base/java.util.ArrayList.forEach(ArrayList.java:1511)
        at org.testng.TestRunner.privateRun(TestRunner.java:764)
        at org.testng.TestRunner.run(TestRunner.java:585)
        at org.testng.SuiteRunner.runTest(SuiteRunner.java:384)
        at org.testng.SuiteRunner.runSequentially(SuiteRunner.java:378)
        at org.testng.SuiteRunner.privateRun(SuiteRunner.java:337)
        at org.testng.SuiteRunner.run(SuiteRunner.java:286)
        at org.testng.SuiteRunnerWorker.runSuite(SuiteRunnerWorker.java:53)
        at org.testng.SuiteRunnerWorker.run(SuiteRunnerWorker.java:96)
        at org.testng.TestNG.runSuitesSequentially(TestNG.java:1218)
        at org.testng.TestNG.runSuitesLocally(TestNG.java:1140)
        at org.testng.TestNG.runSuites(TestNG.java:1069)
        at org.testng.TestNG.run(TestNG.java:1037)
        at com.sun.javatest.regtest.agent.TestNGRunner.main(TestNGRunner.java:94)
        at com.sun.javatest.regtest.agent.TestNGRunner.main(TestNGRunner.java:54)
        at java.base/jdk.internal.reflect.NativeMethodAccessorImpl.invoke0(Native Method)
        at java.base/jdk.internal.reflect.NativeMethodAccessorImpl.invoke(NativeMethodAccessorImpl.java:77)
        at java.base/jdk.internal.reflect.DelegatingMethodAccessorImpl.invoke(DelegatingMethodAccessorImpl.java:43)
        at java.base/java.lang.reflect.Method.invoke(Method.java:568)
        at com.sun.javatest.regtest.agent.MainWrapper$MainThread.run(MainWrapper.java:127)
        at java.base/java.lang.Thread.run(Thread.java:833)
        Caused by: javax.net.ssl.SSLHandshakeException: Remote host terminated the handshake
        at java.net.http/jdk.internal.net.http.common.SSLTube.checkForHandshake(SSLTube.java:595)
        at java.net.http/jdk.internal.net.http.common.SSLTube$SSLTubeFlowDelegate.checkForHandshake(SSLTube.java:156)
        at java.net.http/jdk.internal.net.http.common.SSLFlowDelegate$Reader.errorCommon(SSLFlowDelegate.java:365)
        at java.net.http/jdk.internal.net.http.common.SubscriberWrapper.onError(SubscriberWrapper.java:410)
        at java.net.http/jdk.internal.net.http.SocketTube$InternalReadPublisher$ReadSubscription.signalCompletion(SocketTube.java:637)
        at java.net.http/jdk.internal.net.http.SocketTube$InternalReadPublisher$InternalReadSubscription.read(SocketTube.java:821)
        at java.net.http/jdk.internal.net.http.SocketTube$SocketFlowTask.run(SocketTube.java:181)
        at java.net.http/jdk.internal.net.http.common.SequentialScheduler$SchedulableTask.run(SequentialScheduler.java:230)
        at java.net.http/jdk.internal.net.http.common.SequentialScheduler.runOrSchedule(SequentialScheduler.java:303)
        at java.net.http/jdk.internal.net.http.common.SequentialScheduler.runOrSchedule(SequentialScheduler.java:256)
        at java.net.http/jdk.internal.net.http.SocketTube$InternalReadPublisher$InternalReadSubscription.signalReadable(SocketTube.java:774)
        at java.net.http/jdk.internal.net.http.SocketTube$InternalReadPublisher$ReadEvent.signalEvent(SocketTube.java:957)
        at java.net.http/jdk.internal.net.http.SocketTube$SocketFlowEvent.handle(SocketTube.java:253)
        at java.net.http/jdk.internal.net.http.HttpClientImpl$SelectorManager.handleEvent(HttpClientImpl.java:979)
        at java.net.http/jdk.internal.net.http.HttpClientImpl$SelectorManager.lambda$run$3(HttpClientImpl.java:934)
        at java.base/java.util.ArrayList.forEach(ArrayList.java:1511)
        at java.net.http/jdk.internal.net.http.HttpClientImpl$SelectorManager.run(HttpClientImpl.java:934)
        Caused by: java.net.SocketException: Connection reset
        at java.base/sun.nio.ch.SocketChannelImpl.throwConnectionReset(SocketChannelImpl.java:394)
        at java.base/sun.nio.ch.SocketChannelImpl.read(SocketChannelImpl.java:426)
        at java.net.http/jdk.internal.net.http.SocketTube.readAvailable(SocketTube.java:1170)
        at java.net.http/jdk.internal.net.http.SocketTube$InternalReadPublisher$InternalReadSubscription.read(SocketTube.java:833)
        ... 11 more

        <snip>

        iteration 8
        Status code is 404
        Response is <h1>404 Not Found</h1>No context found for request
        iteration 9
        test WSHandshakeExceptionTest.test("wss://localhost:59320/", true): failure
        java.lang.AssertionError: Unexpected exception
        at WSHandshakeExceptionTest.test(WSHandshakeExceptionTest.java:123)
        at java.base/jdk.internal.reflect.NativeMethodAccessorImpl.invoke0(Native Method)
        at java.base/jdk.internal.reflect.NativeMethodAccessorImpl.invoke(NativeMethodAccessorImpl.java:77)
        at java.base/jdk.internal.reflect.DelegatingMethodAccessorImpl.invoke(DelegatingMethodAccessorImpl.java:43)
        at java.base/java.lang.reflect.Method.invoke(Method.java:568)
        at org.testng.internal.MethodInvocationHelper.invokeMethod(MethodInvocationHelper.java:132)
        at org.testng.internal.TestInvoker.invokeMethod(TestInvoker.java:599)
        at org.testng.internal.TestInvoker.invokeTestMethod(TestInvoker.java:174)
        at org.testng.internal.MethodRunner.runInSequence(MethodRunner.java:46)
        at org.testng.internal.TestInvoker$MethodInvocationAgent.invoke(TestInvoker.java:822)
        at org.testng.internal.TestInvoker.invokeTestMethods(TestInvoker.java:147)
        at org.testng.internal.TestMethodWorker.invokeTestMethods(TestMethodWorker.java:146)
        at org.testng.internal.TestMethodWorker.run(TestMethodWorker.java:128)
        at java.base/java.util.ArrayList.forEach(ArrayList.java:1511)
        at org.testng.TestRunner.privateRun(TestRunner.java:764)
        at org.testng.TestRunner.run(TestRunner.java:585)
        at org.testng.SuiteRunner.runTest(SuiteRunner.java:384)
        at org.testng.SuiteRunner.runSequentially(SuiteRunner.java:378)
        at org.testng.SuiteRunner.privateRun(SuiteRunner.java:337)
        at org.testng.SuiteRunner.run(SuiteRunner.java:286)
        at org.testng.SuiteRunnerWorker.runSuite(SuiteRunnerWorker.java:53)
        at org.testng.SuiteRunnerWorker.run(SuiteRunnerWorker.java:96)
        at org.testng.TestNG.runSuitesSequentially(TestNG.java:1218)
        at org.testng.TestNG.runSuitesLocally(TestNG.java:1140)
        at org.testng.TestNG.runSuites(TestNG.java:1069)
        at org.testng.TestNG.run(TestNG.java:1037)
        at com.sun.javatest.regtest.agent.TestNGRunner.main(TestNGRunner.java:94)
        at com.sun.javatest.regtest.agent.TestNGRunner.main(TestNGRunner.java:54)
        at java.base/jdk.internal.reflect.NativeMethodAccessorImpl.invoke0(Native Method)
        at java.base/jdk.internal.reflect.NativeMethodAccessorImpl.invoke(NativeMethodAccessorImpl.java:77)
        at java.base/jdk.internal.reflect.DelegatingMethodAccessorImpl.invoke(DelegatingMethodAccessorImpl.java:43)
        at java.base/java.lang.reflect.Method.invoke(Method.java:568)
        at com.sun.javatest.regtest.agent.MainWrapper$MainThread.run(MainWrapper.java:127)
        at java.base/java.lang.Thread.run(Thread.java:833)
        Caused by: javax.net.ssl.SSLHandshakeException: Remote host terminated the handshake
        at java.net.http/jdk.internal.net.http.common.SSLTube.checkForHandshake(SSLTube.java:595)
        at java.net.http/jdk.internal.net.http.common.SSLTube$SSLTubeFlowDelegate.checkForHandshake(SSLTube.java:156)
        at java.net.http/jdk.internal.net.http.common.SSLFlowDelegate$Reader.errorCommon(SSLFlowDelegate.java:365)
        at java.net.http/jdk.internal.net.http.common.SubscriberWrapper.onError(SubscriberWrapper.java:410)
        at java.net.http/jdk.internal.net.http.SocketTube$InternalReadPublisher$ReadSubscription.signalCompletion(SocketTube.java:637)
        at java.net.http/jdk.internal.net.http.SocketTube$InternalReadPublisher$InternalReadSubscription.read(SocketTube.java:821)
        at java.net.http/jdk.internal.net.http.SocketTube$SocketFlowTask.run(SocketTube.java:181)
        at java.net.http/jdk.internal.net.http.common.SequentialScheduler$SchedulableTask.run(SequentialScheduler.java:230)
        at java.net.http/jdk.internal.net.http.common.SequentialScheduler.runOrSchedule(SequentialScheduler.java:303)
        at java.net.http/jdk.internal.net.http.common.SequentialScheduler.runOrSchedule(SequentialScheduler.java:256)
        at java.net.http/jdk.internal.net.http.SocketTube$InternalReadPublisher$InternalReadSubscription.handleError(SocketTube.java:757)
        at java.net.http/jdk.internal.net.http.SocketTube$InternalReadPublisher.signalError(SocketTube.java:590)
        at java.net.http/jdk.internal.net.http.SocketTube$InternalWriteSubscriber.signalError(SocketTube.java:433)
        at java.net.http/jdk.internal.net.http.SocketTube$InternalWriteSubscriber.tryFlushCurrent(SocketTube.java:370)
        at java.net.http/jdk.internal.net.http.SocketTube$InternalWriteSubscriber.onNext(SocketTube.java:317)
        at java.net.http/jdk.internal.net.http.SocketTube.onNext(SocketTube.java:135)
        at java.net.http/jdk.internal.net.http.SocketTube.onNext(SocketTube.java:58)
        at java.net.http/jdk.internal.net.http.common.SubscriberWrapper$DownstreamPusher.run1(SubscriberWrapper.java:316)
        at java.net.http/jdk.internal.net.http.common.SubscriberWrapper$DownstreamPusher.run(SubscriberWrapper.java:259)
        at java.net.http/jdk.internal.net.http.common.SequentialScheduler$LockingRestartableTask.run(SequentialScheduler.java:205)
        at java.net.http/jdk.internal.net.http.common.SequentialScheduler$CompleteRestartableTask.run(SequentialScheduler.java:149)
        at java.net.http/jdk.internal.net.http.common.SequentialScheduler$SchedulableTask.run(SequentialScheduler.java:230)
        at java.net.http/jdk.internal.net.http.common.SequentialScheduler.runOrSchedule(SequentialScheduler.java:303)
        at java.net.http/jdk.internal.net.http.common.SequentialScheduler.runOrSchedule(SequentialScheduler.java:256)
        at java.net.http/jdk.internal.net.http.common.SubscriberWrapper.outgoing(SubscriberWrapper.java:232)
        at java.net.http/jdk.internal.net.http.common.SubscriberWrapper.outgoing(SubscriberWrapper.java:198)
        at java.net.http/jdk.internal.net.http.common.SSLFlowDelegate$Writer.sendResultBytes(SSLFlowDelegate.java:934)
        at java.net.http/jdk.internal.net.http.common.SSLFlowDelegate$Writer.processData(SSLFlowDelegate.java:817)
        at java.net.http/jdk.internal.net.http.common.SSLFlowDelegate$Writer$WriterDownstreamPusher.run(SSLFlowDelegate.java:694)
        at java.net.http/jdk.internal.net.http.common.SequentialScheduler$CompleteRestartableTask.run(SequentialScheduler.java:149)
        at java.net.http/jdk.internal.net.http.common.SequentialScheduler$SchedulableTask.run(SequentialScheduler.java:230)
        at java.net.http/jdk.internal.net.http.common.SequentialScheduler.runOrSchedule(SequentialScheduler.java:303)
        at java.net.http/jdk.internal.net.http.common.SequentialScheduler.runOrSchedule(SequentialScheduler.java:256)
        at java.net.http/jdk.internal.net.http.common.SSLFlowDelegate$Writer.incoming(SSLFlowDelegate.java:718)
        at java.net.http/jdk.internal.net.http.common.SubscriberWrapper.incomingCaller(SubscriberWrapper.java:436)
        at java.net.http/jdk.internal.net.http.common.SubscriberWrapper.addData(SubscriberWrapper.java:456)
        at java.net.http/jdk.internal.net.http.common.SSLFlowDelegate$Writer.onSubscribe(SSLFlowDelegate.java:727)
        at java.net.http/jdk.internal.net.http.common.SubscriberWrapper.onSubscribe(SubscriberWrapper.java:369)
        at java.net.http/jdk.internal.net.http.common.SSLTube$SSLTubeFlowDelegate.connect(SSLTube.java:149)
        at java.net.http/jdk.internal.net.http.common.SSLFlowDelegate.<init>(SSLFlowDelegate.java:160)
        at java.net.http/jdk.internal.net.http.common.SSLTube$SSLTubeFlowDelegate.<init>(SSLTube.java:106)
        at java.net.http/jdk.internal.net.http.common.SSLTube.<init>(SSLTube.java:94)
        at java.net.http/jdk.internal.net.http.AsyncSSLConnection.lambda$connectAsync$0(AsyncSSLConnection.java:62)
        at java.base/java.util.concurrent.CompletableFuture$UniApply.tryFire(CompletableFuture.java:646)
        at java.base/java.util.concurrent.CompletableFuture.postComplete(CompletableFuture.java:510)
        at java.base/java.util.concurrent.CompletableFuture$AsyncSupply.run(CompletableFuture.java:1773)
        at java.base/java.util.concurrent.ThreadPoolExecutor.runWorker(ThreadPoolExecutor.java:1136)
        at java.base/java.util.concurrent.ThreadPoolExecutor$Worker.run(ThreadPoolExecutor.java:635)
        ... 1 more
        Caused by: java.io.IOException: No buffer space available
        at java.base/sun.nio.ch.FileDispatcherImpl.writev0(Native Method)
        at java.base/sun.nio.ch.SocketDispatcher.writev(SocketDispatcher.java:66)
        at java.base/sun.nio.ch.IOUtil.write(IOUtil.java:217)
        at java.base/sun.nio.ch.IOUtil.write(IOUtil.java:153)
        at java.base/sun.nio.ch.SocketChannelImpl.write(SocketChannelImpl.java:563)
        at java.base/java.nio.channels.SocketChannel.write(SocketChannel.java:642)
        at java.net.http/jdk.internal.net.http.SocketTube.writeAvailable(SocketTube.java:1236)
        at java.net.http/jdk.internal.net.http.SocketTube$InternalWriteSubscriber.tryFlushCurrent(SocketTube.java:350)
        ... 35 more

          Attachments

            Issue Links

              Activity

                People

                Assignee:
                dfuchs Daniel Fuchs
                Reporter:
                dcubed Daniel Daugherty
                Votes:
                0 Vote for this issue
                Watchers:
                7 Start watching this issue

                  Dates

                  Created:
                  Updated:
                  Resolved: