Uploaded image for project: 'JDK'
  1. JDK
  2. JDK-8268739

AArch64: Build failure after JDK-8267663

    XMLWordPrintable

    Details

    • Subcomponent:
    • Resolved In Build:
      b28
    • CPU:
      aarch64
    • OS:
      generic

      Backports

        Description

        04:41:21 using configure arguments '--with-boot-jdk=/mnt/share/openjdk/packages/boot-jdk/aarch64/master --disable-precompiled-headers --with-debug-level=release --with-version-opt=git-e59acd986 --with-jvm-variants=client --with-gtest=/mnt/share/openjdk/tools/googletest'.
        04:41:21
        04:41:21 Configuration summary:
        04:41:21 * Name: /home/ent-user/ci-scripts/build-release
        04:41:21 * Debug level: release
        04:41:21 * HS debug level: product
        04:41:21 * JVM variants: client
        04:41:21 * JVM features: client: 'cds compiler1 dtrace epsilongc g1gc jfr jni-check jvmti management nmt parallelgc serialgc services shenandoahgc vm-structs zgc'
        04:41:21 * OpenJDK target: OS: linux, CPU architecture: aarch64, address length: 64
        04:41:21 * Version string: 18-internal+0-git-e59acd986 (18-internal)
        04:41:21
        04:41:21 Tools summary:
        04:41:21 * Boot JDK: openjdk version "17-internal" 2021-09-14 OpenJDK Runtime Environment (build 17-internal+0-adhoc.alahay01.gerritjdk) OpenJDK 64-Bit Server VM (build 17-internal+0-adhoc.alahay01.gerritjdk, mixed mode, sharing) (at /mnt/share/openjdk/packages/boot-jdk/aarch64/master)
        04:41:21 * Toolchain: gcc (GNU Compiler Collection)
        04:41:21 * C Compiler: Version 10.2.0 (at /usr/bin/gcc)
        04:41:21 * C++ Compiler: Version 10.2.0 (at /usr/bin/g++)
        04:41:21
        04:41:21 Build performance summary:
        04:41:21 * Cores to use: 30
        04:41:21 * Memory limit: 31483 MB
        04:41:21
        04:41:21 The following warnings were produced. Repeated here for convenience:
        04:41:21 WARNING: Ignoring jtreg from path since a valid jtreg home cannot be found
        04:41:21
        04:41:21 [06-14 20:40:23 UTC]ent-arm-13-ubuntu-openjdk-build:DBG: Running : make images JOBS=45
        04:41:21 Building target 'images' in configuration '/home/ent-user/ci-scripts/build-release'
        04:41:21 Compiling 1 files for BUILD_TOOLS_HOTSPOT
        04:41:21 Compiling 8 files for BUILD_TOOLS_LANGTOOLS
        04:41:21 Compiling 2 files for BUILD_JVMTI_TOOLS
        04:41:21 Parsing 2 properties into enum-like class for jdk.compiler
        04:41:21 Compiling 7 properties into resource bundles for jdk.jshell
        04:41:21 Compiling 13 properties into resource bundles for jdk.javadoc
        04:41:21 Compiling 16 properties into resource bundles for jdk.compiler
        04:41:21 Compiling 12 properties into resource bundles for jdk.jdeps
        04:41:21 Compiling 127 files for BUILD_java.compiler.interim
        04:41:21 Compiling 402 files for BUILD_jdk.compiler.interim
        04:41:21 Compiling 229 files for BUILD_jdk.javadoc.interim
        04:41:21 Creating support/modules_libs/java.base/client/libjvm.so from 941 file(s)
        04:41:21 Creating hotspot/variant-client/libjvm/libgtest/libgtest.a from 2 file(s)
        04:41:21 Creating hotspot/variant-client/libjvm/gtest/libjvm.so from 162 file(s)
        04:41:21 Creating hotspot/variant-client/libjvm/gtest/gtestLauncher from 1 file(s)
        04:41:21 Compiling 31 files for BUILD_JRTFS
        04:41:21 Compiling 185 files for BUILD_TOOLS_JDK
        04:41:21 Compiling 2 files for COMPILE_DEPEND
        04:41:21 Creating support/modules_libs/java.base/jrt-fs.jar
        04:41:26 /home/ent-user/ci-scripts/jdk_src/src/hotspot/cpu/aarch64/macroAssembler_aarch64.cpp: In member function 'void MacroAssembler::neon_compare(FloatRegister, BasicType, FloatRegister, FloatRegister, int, bool)':
        04:41:26 /home/ent-user/ci-scripts/jdk_src/src/hotspot/cpu/aarch64/macroAssembler_aarch64.cpp:5347:12: error: 'BoolTest' has not been declared
        04:41:26 5347 | case BoolTest::eq: fcmeq(dst, size, src1, src2); break;
        04:41:26 | ^~~~~~~~
        04:41:26 /home/ent-user/ci-scripts/jdk_src/src/hotspot/cpu/aarch64/macroAssembler_aarch64.cpp:5348:12: error: 'BoolTest' has not been declared
        04:41:26 5348 | case BoolTest::ne: {
        04:41:26 | ^~~~~~~~
        04:41:26 /home/ent-user/ci-scripts/jdk_src/src/hotspot/cpu/aarch64/macroAssembler_aarch64.cpp:5353:12: error: 'BoolTest' has not been declared
        04:41:26 5353 | case BoolTest::ge: fcmge(dst, size, src1, src2); break;
        04:41:26 | ^~~~~~~~
        04:41:26 /home/ent-user/ci-scripts/jdk_src/src/hotspot/cpu/aarch64/macroAssembler_aarch64.cpp:5354:12: error: 'BoolTest' has not been declared
        04:41:26 5354 | case BoolTest::gt: fcmgt(dst, size, src1, src2); break;
        04:41:26 | ^~~~~~~~
        04:41:26 /home/ent-user/ci-scripts/jdk_src/src/hotspot/cpu/aarch64/macroAssembler_aarch64.cpp:5355:12: error: 'BoolTest' has not been declared
        04:41:26 5355 | case BoolTest::le: fcmge(dst, size, src2, src1); break;
        04:41:26 | ^~~~~~~~
        04:41:26 /home/ent-user/ci-scripts/jdk_src/src/hotspot/cpu/aarch64/macroAssembler_aarch64.cpp:5356:12: error: 'BoolTest' has not been declared
        04:41:26 5356 | case BoolTest::lt: fcmgt(dst, size, src2, src1); break;
        04:41:26 | ^~~~~~~~
        04:41:26 /home/ent-user/ci-scripts/jdk_src/src/hotspot/cpu/aarch64/macroAssembler_aarch64.cpp:5363:12: error: 'BoolTest' has not been declared
        04:41:26 5363 | case BoolTest::eq: cmeq(dst, size, src1, src2); break;
        04:41:26 | ^~~~~~~~
        04:41:26 /home/ent-user/ci-scripts/jdk_src/src/hotspot/cpu/aarch64/macroAssembler_aarch64.cpp:5364:12: error: 'BoolTest' has not been declared
        04:41:26 5364 | case BoolTest::ne: {
        04:41:26 | ^~~~~~~~
        04:41:26 /home/ent-user/ci-scripts/jdk_src/src/hotspot/cpu/aarch64/macroAssembler_aarch64.cpp:5369:12: error: 'BoolTest' has not been declared
        04:41:26 5369 | case BoolTest::ge: cmge(dst, size, src1, src2); break;
        04:41:26 | ^~~~~~~~
        04:41:26 /home/ent-user/ci-scripts/jdk_src/src/hotspot/cpu/aarch64/macroAssembler_aarch64.cpp:5370:12: error: 'BoolTest' has not been declared
        04:41:26 5370 | case BoolTest::gt: cmgt(dst, size, src1, src2); break;
        04:41:26 | ^~~~~~~~
        04:41:26 /home/ent-user/ci-scripts/jdk_src/src/hotspot/cpu/aarch64/macroAssembler_aarch64.cpp:5371:12: error: 'BoolTest' has not been declared
        04:41:26 5371 | case BoolTest::le: cmge(dst, size, src2, src1); break;
        04:41:26 | ^~~~~~~~
        04:41:26 /home/ent-user/ci-scripts/jdk_src/src/hotspot/cpu/aarch64/macroAssembler_aarch64.cpp:5372:12: error: 'BoolTest' has not been declared
        04:41:26 5372 | case BoolTest::lt: cmgt(dst, size, src2, src1); break;
        04:41:26 | ^~~~~~~~
        04:41:26 /home/ent-user/ci-scripts/jdk_src/src/hotspot/cpu/aarch64/macroAssembler_aarch64.cpp:5373:12: error: 'BoolTest' has not been declared
        04:41:26 5373 | case BoolTest::uge: cmhs(dst, size, src1, src2); break;
        04:41:26 | ^~~~~~~~
        04:41:26 /home/ent-user/ci-scripts/jdk_src/src/hotspot/cpu/aarch64/macroAssembler_aarch64.cpp:5374:12: error: 'BoolTest' has not been declared
        04:41:26 5374 | case BoolTest::ugt: cmhi(dst, size, src1, src2); break;
        04:41:26 | ^~~~~~~~
        04:41:26 /home/ent-user/ci-scripts/jdk_src/src/hotspot/cpu/aarch64/macroAssembler_aarch64.cpp:5375:12: error: 'BoolTest' has not been declared
        04:41:26 5375 | case BoolTest::ult: cmhi(dst, size, src2, src1); break;
        04:41:26 | ^~~~~~~~
        04:41:26 /home/ent-user/ci-scripts/jdk_src/src/hotspot/cpu/aarch64/macroAssembler_aarch64.cpp:5376:12: error: 'BoolTest' has not been declared
        04:41:26 5376 | case BoolTest::ule: cmhs(dst, size, src2, src1); break;
        04:41:26 | ^~~~~~~~
        04:41:27 make[3]: *** [lib/CompileJvm.gmk:143: /home/ent-user/ci-scripts/build-release/hotspot/variant-client/libjvm/objs/macroAssembler_aarch64.o] Error 1

          Attachments

            Issue Links

              Activity

                People

                Assignee:
                eliu Eric Liu
                Reporter:
                eliu Eric Liu
                Votes:
                0 Vote for this issue
                Watchers:
                3 Start watching this issue

                  Dates

                  Created:
                  Updated:
                  Resolved: