Uploaded image for project: 'JDK'
  1. JDK
  2. JDK-8271133

Compile Android_S show error

    XMLWordPrintable

    Details

    • Subcomponent:
    • CPU:
      x86_64
    • OS:
      windows_10

      Description

      A DESCRIPTION OF THE PROBLEM :
      when I use Studio to Compile Android_S,is always show error below:

      > Task :compileDebugJavaWithJavac FAILED
      编译器 (1.8.0_181) 中出现异常错误。如果在 Bug Database (http://bugs.java.com) 中没有找到该错误, 请通过 Java Bug 报告页 (http://bugreport.java.com) 建立该 Java 编译器 Bug。请在报告中附上您的程序和以下诊断信息。谢谢。
      java.lang.AssertionError: annotationType(): unrecognized Attribute name MODULE (class com.sun.tools.javac.util.UnsharedNameTable$NameImpl)
      at com.sun.tools.javac.util.Assert.error(Assert.java:133)
      at com.sun.tools.javac.code.TypeAnnotations.annotationType(TypeAnnotations.java:231)
      at com.sun.tools.javac.code.TypeAnnotations$TypeAnnotationPositions.separateAnnotationsKinds(TypeAnnotations.java:294)
      at com.sun.tools.javac.code.TypeAnnotations$TypeAnnotationPositions.visitMethodDef(TypeAnnotations.java:1066)
      at com.sun.tools.javac.tree.JCTree$JCMethodDecl.accept(JCTree.java:778)
      at com.sun.tools.javac.tree.TreeScanner.scan(TreeScanner.java:49)
      at com.sun.tools.javac.code.TypeAnnotations$TypeAnnotationPositions.scan(TypeAnnotations.java:275)
      at com.sun.tools.javac.tree.TreeScanner.scan(TreeScanner.java:57)
      at com.sun.tools.javac.code.TypeAnnotations$TypeAnnotationPositions.visitClassDef(TypeAnnotations.java:1042)
      at com.sun.tools.javac.tree.JCTree$JCClassDecl.accept(JCTree.java:693)
      at com.sun.tools.javac.tree.TreeScanner.scan(TreeScanner.java:49)
      at com.sun.tools.javac.code.TypeAnnotations$TypeAnnotationPositions.scan(TypeAnnotations.java:275)
      at com.sun.tools.javac.code.TypeAnnotations$1.run(TypeAnnotations.java:127)
      at com.sun.tools.javac.comp.Annotate.flush(Annotate.java:152)
      at com.sun.tools.javac.comp.Annotate.enterDone(Annotate.java:129)
      at com.sun.tools.javac.comp.Enter.complete(Enter.java:512)
      at com.sun.tools.javac.comp.Enter.main(Enter.java:471)
      at com.sun.tools.javac.main.JavaCompiler.enterTrees(JavaCompiler.java:982)
      at com.sun.tools.javac.main.JavaCompiler.compile(JavaCompiler.java:857)
      at com.sun.tools.javac.main.Main.compile(Main.java:523)
      at com.sun.tools.javac.api.JavacTaskImpl.doCall(JavacTaskImpl.java:129)
      at com.sun.tools.javac.api.JavacTaskImpl.call(JavacTaskImpl.java:138)
      at org.gradle.internal.compiler.java.IncrementalCompileTask.call(IncrementalCompileTask.java:74)
      at org.gradle.api.internal.tasks.compile.AnnotationProcessingCompileTask.call(AnnotationProcessingCompileTask.java:93)
      at org.gradle.api.internal.tasks.compile.ResourceCleaningCompilationTask.call(ResourceCleaningCompilationTask.java:57)
      at org.gradle.api.internal.tasks.compile.JdkJavaCompiler.execute(JdkJavaCompiler.java:55)
      at org.gradle.api.internal.tasks.compile.JdkJavaCompiler.execute(JdkJavaCompiler.java:40)
      at org.gradle.api.internal.tasks.compile.NormalizingJavaCompiler.delegateAndHandleErrors(NormalizingJavaCompiler.java:97)
      at org.gradle.api.internal.tasks.compile.NormalizingJavaCompiler.execute(NormalizingJavaCompiler.java:51)
      at org.gradle.api.internal.tasks.compile.NormalizingJavaCompiler.execute(NormalizingJavaCompiler.java:37)
      at org.gradle.api.internal.tasks.compile.AnnotationProcessorDiscoveringCompiler.execute(AnnotationProcessorDiscoveringCompiler.java:51)
      at org.gradle.api.internal.tasks.compile.AnnotationProcessorDiscoveringCompiler.execute(AnnotationProcessorDiscoveringCompiler.java:37)
      at org.gradle.api.internal.tasks.compile.ModuleApplicationNameWritingCompiler.execute(ModuleApplicationNameWritingCompiler.java:46)
      at org.gradle.api.internal.tasks.compile.ModuleApplicationNameWritingCompiler.execute(ModuleApplicationNameWritingCompiler.java:36)
      at org.gradle.api.internal.tasks.compile.CleaningJavaCompiler.execute(CleaningJavaCompiler.java:53)
      at org.gradle.api.internal.tasks.compile.incremental.IncrementalCompilerFactory.lambda$createRebuildAllCompiler$0(IncrementalCompilerFactory.java:98)
      at org.gradle.api.internal.tasks.compile.incremental.IncrementalResultStoringCompiler.execute(IncrementalResultStoringCompiler.java:60)
      at org.gradle.api.internal.tasks.compile.incremental.IncrementalResultStoringCompiler.execute(IncrementalResultStoringCompiler.java:44)
      at org.gradle.api.internal.tasks.compile.CompileJavaBuildOperationReportingCompiler$2.call(CompileJavaBuildOperationReportingCompiler.java:59)
      at org.gradle.api.internal.tasks.compile.CompileJavaBuildOperationReportingCompiler$2.call(CompileJavaBuildOperationReportingCompiler.java:51)
      at org.gradle.internal.operations.DefaultBuildOperationExecutor$CallableBuildOperationWorker.execute(DefaultBuildOperationExecutor.java:409)
      at org.gradle.internal.operations.DefaultBuildOperationExecutor$CallableBuildOperationWorker.execute(DefaultBuildOperationExecutor.java:399)
      at org.gradle.internal.operations.DefaultBuildOperationExecutor$1.execute(DefaultBuildOperationExecutor.java:157)
      at org.gradle.internal.operations.DefaultBuildOperationExecutor.execute(DefaultBuildOperationExecutor.java:242)
      at org.gradle.internal.operations.DefaultBuildOperationExecutor.execute(DefaultBuildOperationExecutor.java:150)
      at org.gradle.internal.operations.DefaultBuildOperationExecutor.call(DefaultBuildOperationExecutor.java:94)
      at org.gradle.internal.operations.DelegatingBuildOperationExecutor.call(DelegatingBuildOperationExecutor.java:36)
      at org.gradle.api.internal.tasks.compile.CompileJavaBuildOperationReportingCompiler.execute(CompileJavaBuildOperationReportingCompiler.java:51)
      at org.gradle.api.tasks.compile.JavaCompile.performCompilation(JavaCompile.java:293)
      at org.gradle.api.tasks.compile.JavaCompile.performIncrementalCompilation(JavaCompile.java:203)
      at org.gradle.api.tasks.compile.JavaCompile.compile(JavaCompile.java:183)
      at sun.reflect.NativeMethodAccessorImpl.invoke0(Native Method)
      at sun.reflect.NativeMethodAccessorImpl.invoke(NativeMethodAccessorImpl.java:62)
      at sun.reflect.DelegatingMethodAccessorImpl.invoke(DelegatingMethodAccessorImpl.java:43)
      at java.lang.reflect.Method.invoke(Method.java:498)
      at org.gradle.internal.reflect.JavaMethod.invoke(JavaMethod.java:104)
      at org.gradle.api.internal.project.taskfactory.IncrementalInputsTaskAction.doExecute(IncrementalInputsTaskAction.java:32)
      at org.gradle.api.internal.project.taskfactory.StandardTaskAction.execute(StandardTaskAction.java:42)
      at org.gradle.api.internal.project.taskfactory.AbstractIncrementalTaskAction.execute(AbstractIncrementalTaskAction.java:25)
      at org.gradle.api.internal.project.taskfactory.StandardTaskAction.execute(StandardTaskAction.java:28)
      at org.gradle.api.internal.tasks.execution.ExecuteActionsTaskExecuter$3.run(ExecuteActionsTaskExecuter.java:569)
      at org.gradle.internal.operations.DefaultBuildOperationExecutor$RunnableBuildOperationWorker.execute(DefaultBuildOperationExecutor.java:395)
      at org.gradle.internal.operations.DefaultBuildOperationExecutor$RunnableBuildOperationWorker.execute(DefaultBuildOperationExecutor.java:387)
      at org.gradle.internal.operations.DefaultBuildOperationExecutor$1.execute(DefaultBuildOperationExecutor.java:157)
      at org.gradle.internal.operations.DefaultBuildOperationExecutor.execute(DefaultBuildOperationExecutor.java:242)
      at org.gradle.internal.operations.DefaultBuildOperationExecutor.execute(DefaultBuildOperationExecutor.java:150)
      at org.gradle.internal.operations.DefaultBuildOperationExecutor.run(DefaultBuildOperationExecutor.java:84)
      at org.gradle.internal.operations.DelegatingBuildOperationExecutor.run(DelegatingBuildOperationExecutor.java:31)
      at org.gradle.api.internal.tasks.execution.ExecuteActionsTaskExecuter.executeAction(ExecuteActionsTaskExecuter.java:554)
      at org.gradle.api.internal.tasks.execution.ExecuteActionsTaskExecuter.executeActions(ExecuteActionsTaskExecuter.java:537)
      at org.gradle.api.internal.tasks.execution.ExecuteActionsTaskExecuter.access$300(ExecuteActionsTaskExecuter.java:108)
      at org.gradle.api.internal.tasks.execution.ExecuteActionsTaskExecuter$TaskExecution.executeWithPreviousOutputFiles(ExecuteActionsTaskExecuter.java:278)
      at org.gradle.api.internal.tasks.execution.ExecuteActionsTaskExecuter$TaskExecution.execute(ExecuteActionsTaskExecuter.java:267)
      at org.gradle.internal.execution.steps.ExecuteStep.lambda$execute$0(ExecuteStep.java:32)
      at java.util.Optional.map(Optional.java:215)
      at org.gradle.internal.execution.steps.ExecuteStep.execute(ExecuteStep.java:32)
      at org.gradle.internal.execution.steps.ExecuteStep.execute(ExecuteStep.java:26)
      at org.gradle.internal.execution.steps.CleanupOutputsStep.execute(CleanupOutputsStep.java:67)
      at org.gradle.internal.execution.steps.CleanupOutputsStep.execute(CleanupOutputsStep.java:36)
      at org.gradle.internal.execution.steps.ResolveInputChangesStep.execute(ResolveInputChangesStep.java:49)
      at org.gradle.internal.execution.steps.ResolveInputChangesStep.execute(ResolveInputChangesStep.java:34)
      at org.gradle.internal.execution.steps.CancelExecutionStep.execute(CancelExecutionStep.java:43)
      at org.gradle.internal.execution.steps.TimeoutStep.executeWithoutTimeout(TimeoutStep.java:73)
      at org.gradle.internal.execution.steps.TimeoutStep.execute(TimeoutStep.java:54)
      at org.gradle.internal.execution.steps.CatchExceptionStep.execute(CatchExceptionStep.java:34)
      at org.gradle.internal.execution.steps.CreateOutputsStep.execute(CreateOutputsStep.java:44)
      at org.gradle.internal.execution.steps.SnapshotOutputsStep.execute(SnapshotOutputsStep.java:54)
      at org.gradle.internal.execution.steps.SnapshotOutputsStep.execute(SnapshotOutputsStep.java:38)
      at org.gradle.internal.execution.steps.BroadcastChangingOutputsStep.execute(BroadcastChangingOutputsStep.java:49)
      at org.gradle.internal.execution.steps.CacheStep.executeWithoutCache(CacheStep.java:159)
      at org.gradle.internal.execution.steps.CacheStep.execute(CacheStep.java:72)
      at org.gradle.internal.execution.steps.CacheStep.execute(CacheStep.java:43)
      at org.gradle.internal.execution.steps.StoreExecutionStateStep.execute(StoreExecutionStateStep.java:44)
      at org.gradle.internal.execution.steps.StoreExecutionStateStep.execute(StoreExecutionStateStep.java:33)
      at org.gradle.internal.execution.steps.RecordOutputsStep.execute(RecordOutputsStep.java:38)
      at org.gradle.internal.execution.steps.RecordOutputsStep.execute(RecordOutputsStep.java:24)
      at org.gradle.internal.execution.steps.SkipUpToDateStep.executeBecause(SkipUpToDateStep.java:92)
      at org.gradle.internal.execution.steps.SkipUpToDateStep.lambda$execute$0(SkipUpToDateStep.java:85)
      at java.util.Optional.map(Optional.java:215)
      at org.gradle.internal.execution.steps.SkipUpToDateStep.execute(SkipUpToDateStep.java:55)
      at org.gradle.internal.execution.steps.SkipUpToDateStep.execute(SkipUpToDateStep.java:39)
      at org.gradle.internal.execution.steps.ResolveChangesStep.execute(ResolveChangesStep.java:76)
      at org.gradle.internal.execution.steps.ResolveChangesStep.execute(ResolveChangesStep.java:37)
      at org.gradle.internal.execution.steps.legacy.MarkSnapshottingInputsFinishedStep.execute(MarkSnapshottingInputsFinishedStep.java:36)
      at org.gradle.internal.execution.steps.legacy.MarkSnapshottingInputsFinishedStep.execute(MarkSnapshottingInputsFinishedStep.java:26)
      at org.gradle.internal.execution.steps.ResolveCachingStateStep.execute(ResolveCachingStateStep.java:94)
      at org.gradle.internal.execution.steps.ResolveCachingStateStep.execute(ResolveCachingStateStep.java:49)
      at org.gradle.internal.execution.steps.CaptureStateBeforeExecutionStep.execute(CaptureStateBeforeExecutionStep.java:79)
      at org.gradle.internal.execution.steps.CaptureStateBeforeExecutionStep.execute(CaptureStateBeforeExecutionStep.java:53)
      at org.gradle.internal.execution.steps.ValidateStep.execute(ValidateStep.java:74)
      at org.gradle.internal.execution.steps.SkipEmptyWorkStep.lambda$execute$2(SkipEmptyWorkStep.java:78)
      at java.util.Optional.orElseGet(Optional.java:267)
      at org.gradle.internal.execution.steps.SkipEmptyWorkStep.execute(SkipEmptyWorkStep.java:78)
      at org.gradle.internal.execution.steps.SkipEmptyWorkStep.execute(SkipEmptyWorkStep.java:34)
      at org.gradle.internal.execution.steps.legacy.MarkSnapshottingInputsStartedStep.execute(MarkSnapshottingInputsStartedStep.java:39)
      at org.gradle.internal.execution.steps.LoadExecutionStateStep.execute(LoadExecutionStateStep.java:40)
      at org.gradle.internal.execution.steps.LoadExecutionStateStep.execute(LoadExecutionStateStep.java:28)
      at org.gradle.internal.execution.impl.DefaultWorkExecutor.execute(DefaultWorkExecutor.java:33)
      at org.gradle.api.internal.tasks.execution.ExecuteActionsTaskExecuter.executeIfValid(ExecuteActionsTaskExecuter.java:194)
      at org.gradle.api.internal.tasks.execution.ExecuteActionsTaskExecuter.execute(ExecuteActionsTaskExecuter.java:186)
      at org.gradle.api.internal.tasks.execution.CleanupStaleOutputsExecuter.execute(CleanupStaleOutputsExecuter.java:114)
      at org.gradle.api.internal.tasks.execution.FinalizePropertiesTaskExecuter.execute(FinalizePropertiesTaskExecuter.java:46)
      at org.gradle.api.internal.tasks.execution.ResolveTaskExecutionModeExecuter.execute(ResolveTaskExecutionModeExecuter.java:62)
      at org.gradle.api.internal.tasks.execution.SkipTaskWithNoActionsExecuter.execute(SkipTaskWithNoActionsExecuter.java:57)
      at org.gradle.api.internal.tasks.execution.SkipOnlyIfTaskExecuter.execute(SkipOnlyIfTaskExecuter.java:56)
      at org.gradle.api.internal.tasks.execution.CatchExceptionTaskExecuter.execute(CatchExceptionTaskExecuter.java:36)
      at org.gradle.api.internal.tasks.execution.EventFiringTaskExecuter$1.executeTask(EventFiringTaskExecuter.java:77)
      at org.gradle.api.internal.tasks.execution.EventFiringTaskExecuter$1.call(EventFiringTaskExecuter.java:55)
      at org.gradle.api.internal.tasks.execution.EventFiringTaskExecuter$1.call(EventFiringTaskExecuter.java:52)
      at org.gradle.internal.operations.DefaultBuildOperationExecutor$CallableBuildOperationWorker.execute(DefaultBuildOperationExecutor.java:409)
      at org.gradle.internal.operations.DefaultBuildOperationExecutor$CallableBuildOperationWorker.execute(DefaultBuildOperationExecutor.java:399)
      at org.gradle.internal.operations.DefaultBuildOperationExecutor$1.execute(DefaultBuildOperationExecutor.java:157)
      at org.gradle.internal.operations.DefaultBuildOperationExecutor.execute(DefaultBuildOperationExecutor.java:242)
      at org.gradle.internal.operations.DefaultBuildOperationExecutor.execute(DefaultBuildOperationExecutor.java:150)
      at org.gradle.internal.operations.DefaultBuildOperationExecutor.call(DefaultBuildOperationExecutor.java:94)
      at org.gradle.internal.operations.DelegatingBuildOperationExecutor.call(DelegatingBuildOperationExecutor.java:36)
      at org.gradle.api.internal.tasks.execution.EventFiringTaskExecuter.execute(EventFiringTaskExecuter.java:52)
      at org.gradle.execution.plan.LocalTaskNodeExecutor.execute(LocalTaskNodeExecutor.java:41)
      at org.gradle.execution.taskgraph.DefaultTaskExecutionGraph$InvokeNodeExecutorsAction.execute(DefaultTaskExecutionGraph.java:356)
      at org.gradle.execution.taskgraph.DefaultTaskExecutionGraph$InvokeNodeExecutorsAction.execute(DefaultTaskExecutionGraph.java:343)
      at org.gradle.execution.taskgraph.DefaultTaskExecutionGraph$BuildOperationAwareExecutionAction.execute(DefaultTaskExecutionGraph.java:336)
      at org.gradle.execution.taskgraph.DefaultTaskExecutionGraph$BuildOperationAwareExecutionAction.execute(DefaultTaskExecutionGraph.java:322)
      at org.gradle.execution.plan.DefaultPlanExecutor$ExecutorWorker.lambda$run$0(DefaultPlanExecutor.java:127)
      at org.gradle.execution.plan.DefaultPlanExecutor$ExecutorWorker.execute(DefaultPlanExecutor.java:191)
      at org.gradle.execution.plan.DefaultPlanExecutor$ExecutorWorker.executeNextNode(DefaultPlanExecutor.java:182)
      at org.gradle.execution.plan.DefaultPlanExecutor$ExecutorWorker.run(DefaultPlanExecutor.java:124)
      at org.gradle.internal.concurrent.ExecutorPolicy$CatchAndRecordFailures.onExecute(ExecutorPolicy.java:64)
      at org.gradle.internal.concurrent.ManagedExecutorImpl$1.run(ManagedExecutorImpl.java:48)
      at java.util.concurrent.ThreadPoolExecutor.runWorker(ThreadPoolExecutor.java:1149)
      at java.util.concurrent.ThreadPoolExecutor$Worker.run(ThreadPoolExecutor.java:624)
      at org.gradle.internal.concurrent.ThreadFactoryImpl$ManagedThreadRunnable.run(ThreadFactoryImpl.java:56)
      at java.lang.Thread.run(Thread.java:748)

      FAILURE: Build failed with an exception.

      * What went wrong:
      Execution failed for task ':compileDebugJavaWithJavac'.
      > Compilation failed; see the compiler error output for details.

      * Try:
      Run with --stacktrace option to get the stack trace. Run with --info or --debug option to get more log output. Run with --scan to get full insights.

      * Get more help at https://help.gradle.org

      Deprecated Gradle features were used in this build, making it incompatible with Gradle 7.0.
      Use '--warning-mode all' to show the individual deprecation warnings.
      See https://docs.gradle.org/6.5/userguide/command_line_interface.html#sec:command_line_warnings

      BUILD FAILED in 2s
      13 actionable tasks: 1 executed, 12 up-to-date




      when I use jdk9 or jdk 11 for stuido to Compile Android_S,is always show error below:

      > Task :compileDebugJavaWithJavac
      G:\workspace\AndroidS\S_SystemUI\src\com\android\keyguard\AnimatableClockController.java:25: 错误: 程序包android.icu.text不存在
      import android.icu.text.NumberFormat;
                             ^
      G:\workspace\AndroidS\S_SystemUI\src\com\android\keyguard\AnimatableClockView.java:24: 错误: 程序包android.icu.text不存在
      import android.icu.text.DateTimePatternGenerator;
                             ^
      G:\workspace\AndroidS\S_SystemUI\src\com\android\keyguard\AnimatableClockController.java:60: 错误: 找不到符号
          private final NumberFormat mBurmeseNf = NumberFormat.getInstance(Locale.forLanguageTag("my"));
                        ^
        符号: 类 NumberFormat
        位置: 类 AnimatableClockController
      G:\workspace\AndroidS\S_SystemUI\src\com\android\systemui\statusbar\policy\Clock.java:26: 错误: 程序包android.icu.text不存在
      import android.icu.text.DateTimePatternGenerator;
                             ^
      G:\workspace\AndroidS\S_SystemUI\src\com\android\systemui\keyguard\KeyguardSliceProvider.java:30: 错误: 程序包android.icu.text不存在
      import android.icu.text.DateFormat;
                             ^
      G:\workspace\AndroidS\S_SystemUI\src\com\android\systemui\keyguard\KeyguardSliceProvider.java:31: 错误: 程序包android.icu.text不存在
      import android.icu.text.DisplayContext;
                             ^
      G:\workspace\AndroidS\S_SystemUI\src\com\android\systemui\keyguard\KeyguardSliceProvider.java:124: 错误: 找不到符号
          private DateFormat mDateFormat;
                  ^
        符号: 类 DateFormat
        位置: 类 KeyguardSliceProvider
      G:\workspace\AndroidS\S_SystemUI\src\com\android\systemui\statusbar\policy\DateView.java:24: 错误: 程序包android.icu.text不存在
      import android.icu.text.DateFormat;
                             ^
      G:\workspace\AndroidS\S_SystemUI\src\com\android\systemui\statusbar\policy\DateView.java:25: 错误: 程序包android.icu.text不存在
      import android.icu.text.DisplayContext;
                             ^
      G:\workspace\AndroidS\S_SystemUI\src\com\android\systemui\statusbar\policy\DateView.java:43: 错误: 找不到符号
          private DateFormat mDateFormat;
                  ^
        符号: 类 DateFormat
        位置: 类 DateView
      G:\workspace\AndroidS\S_SystemUI\src\com\android\systemui\statusbar\notification\row\NotificationContentView.java:1322: 错误: 找不到符号
                          ? R.drawable.bubble_ic_stop_bubble
                                      ^
        符号: 变量 bubble_ic_stop_bubble
        位置: 类 drawable
      G:\workspace\AndroidS\S_SystemUI\src\com\android\systemui\statusbar\notification\row\NotificationContentView.java:1323: 错误: 找不到符号
                          : R.drawable.bubble_ic_create_bubble);
                                      ^
        符号: 变量 bubble_ic_create_bubble
        位置: 类 drawable
      G:\workspace\AndroidS\S_SystemUI\src\com\android\systemui\statusbar\notification\collection\notifcollection\NotifCollectionListener.java:105: 警告: [dep-ann] 未使用 @Deprecated 对已过时的项目进行注释
          default void onRankingUpdate(NotificationListenerService.RankingMap rankingMap) {
                       ^
      G:\workspace\AndroidS\S_SystemUI\src\com\android\keyguard\AnimatableClockController.java:60: 错误: 找不到符号
          private final NumberFormat mBurmeseNf = NumberFormat.getInstance(Locale.forLanguageTag("my"));
                                                  ^
        符号: 变量 NumberFormat
        位置: 类 AnimatableClockController
      G:\workspace\AndroidS\S_SystemUI\src\com\android\keyguard\AnimatableClockController.java:205: 错误: 找不到符号
                  NumberFormat nf = NumberFormat.getInstance(mLocale);
                  ^
        符号: 类 NumberFormat
        位置: 类 AnimatableClockController
      G:\workspace\AndroidS\S_SystemUI\src\com\android\keyguard\AnimatableClockController.java:205: 错误: 找不到符号
                  NumberFormat nf = NumberFormat.getInstance(mLocale);
                                    ^
        符号: 变量 NumberFormat
        位置: 类 AnimatableClockController
      G:\workspace\AndroidS\S_SystemUI\src\com\android\keyguard\AnimatableClockView.java:278: 错误: 找不到符号
              DateTimePatternGenerator dtpg = DateTimePatternGenerator.getInstance(
              ^
        符号: 类 DateTimePatternGenerator
        位置: 类 AnimatableClockView
      G:\workspace\AndroidS\S_SystemUI\src\com\android\keyguard\AnimatableClockView.java:278: 错误: 找不到符号
              DateTimePatternGenerator dtpg = DateTimePatternGenerator.getInstance(
                                              ^
        符号: 变量 DateTimePatternGenerator
        位置: 类 AnimatableClockView
      G:\workspace\AndroidS\S_SystemUI\src\com\android\systemui\BatteryMeterView.java:126: 错误: 找不到符号
                      context.getColor(R.color.meter_background_color));
                                              ^
        符号: 变量 meter_background_color
        位置: 类 color
      G:\workspace\AndroidS\S_SystemUI\src\com\android\systemui\qs\customize\TileAdapter.java:695: 错误: 找不到符号
                  int column = span.getSpanIndex(holder.getBindingAdapterPosition(), lm.getSpanCount());
                                                       ^
        符号: 方法 getBindingAdapterPosition()
        位置: 类型为ViewHolder的变量 holder
      G:\workspace\AndroidS\S_SystemUI\src\com\android\systemui\statusbar\policy\Clock.java:369: 错误: 找不到符号
              DateTimePatternGenerator dtpg = DateTimePatternGenerator.getInstance(
              ^
        符号: 类 DateTimePatternGenerator
        位置: 类 Clock
      G:\workspace\AndroidS\S_SystemUI\src\com\android\systemui\statusbar\policy\Clock.java:369: 错误: 找不到符号
              DateTimePatternGenerator dtpg = DateTimePatternGenerator.getInstance(
                                              ^
        符号: 变量 DateTimePatternGenerator
        位置: 类 Clock
      G:\workspace\AndroidS\S_SystemUI\build\generated\aidl_source_output_dir\debug\out\com\android\systemui\shared\recents\ISystemUiProxy.java:93: 警告: [dep-ann] 未使用 @Deprecated 对已过时的项目进行注释
          @Override public void handleImageAsScreenshot(android.graphics.Bitmap screenImage, android.graphics.Rect locationInScreen, android.graphics.Insets visibleInsets, int taskId) throws android.os.RemoteException
                                ^
      G:\workspace\AndroidS\S_SystemUI\build\generated\aidl_source_output_dir\debug\out\com\android\systemui\shared\recents\ISystemUiProxy.java:708: 警告: [dep-ann] 未使用 @Deprecated 对已过时的项目进行注释
            @Override public void handleImageAsScreenshot(android.graphics.Bitmap screenImage, android.graphics.Rect locationInScreen, android.graphics.Insets visibleInsets, int taskId) throws android.os.RemoteException
                                  ^
      G:\workspace\AndroidS\S_SystemUI\build\generated\aidl_source_output_dir\debug\out\com\android\systemui\shared\recents\ISystemUiProxy.java:1037: 警告: [dep-ann] 未使用 @Deprecated 对已过时的项目进行注释
        public void handleImageAsScreenshot(android.graphics.Bitmap screenImage, android.graphics.Rect locationInScreen, android.graphics.Insets visibleInsets, int taskId) throws android.os.RemoteException;
                    ^
      G:\workspace\AndroidS\S_SystemUI\src\com\android\systemui\shared\system\ActivityManagerWrapper.java:264: 警告: [dep-ann] 未使用 @Deprecated 对已过时的项目进行注释
          public void registerTaskStackListener(TaskStackChangeListener listener) {
                      ^
      G:\workspace\AndroidS\S_SystemUI\src\com\android\systemui\shared\system\ActivityManagerWrapper.java:271: 警告: [dep-ann] 未使用 @Deprecated 对已过时的项目进行注释
          public void unregisterTaskStackListener(TaskStackChangeListener listener) {
                      ^
      G:\workspace\AndroidS\S_SystemUI\src\com\android\systemui\keyguard\KeyguardSliceProvider.java:415: 错误: 找不到符号
                  DateFormat format = DateFormat.getInstanceForSkeleton(mDatePattern, l);
                  ^
        符号: 类 DateFormat
        位置: 类 KeyguardSliceProvider
      G:\workspace\AndroidS\S_SystemUI\src\com\android\systemui\keyguard\KeyguardSliceProvider.java:415: 错误: 找不到符号
                  DateFormat format = DateFormat.getInstanceForSkeleton(mDatePattern, l);
                                      ^
        符号: 变量 DateFormat
        位置: 类 KeyguardSliceProvider
      G:\workspace\AndroidS\S_SystemUI\src\com\android\systemui\keyguard\KeyguardSliceProvider.java:416: 错误: 找不到符号
                  format.setContext(DisplayContext.CAPITALIZATION_FOR_STANDALONE);
                                    ^
        符号: 变量 DisplayContext
        位置: 类 KeyguardSliceProvider
      G:\workspace\AndroidS\S_SystemUI\src\com\android\systemui\volume\VolumeDialogImpl.java:1545: 错误: 找不到符号
                      addRow(stream, R.drawable.ic_volume_remote, R.drawable.ic_volume_remote_mute, true,
                                               ^
        符号: 变量 ic_volume_remote
        位置: 类 drawable
      G:\workspace\AndroidS\S_SystemUI\src\com\android\systemui\volume\VolumeDialogImpl.java:1545: 错误: 找不到符号
                      addRow(stream, R.drawable.ic_volume_remote, R.drawable.ic_volume_remote_mute, true,
                                                                            ^
        符号: 变量 ic_volume_remote_mute
        位置: 类 drawable
      G:\workspace\AndroidS\S_SystemUI\src\com\android\systemui\media\dialog\MediaOutputBaseAdapter.java:328: 错误: 找不到符号
                          R.color.advanced_icon_color, mContext.getTheme());
                                 ^
        符号: 变量 advanced_icon_color
        位置: 类 color
      G:\workspace\AndroidS\S_SystemUI\src\com\android\systemui\people\PeopleStoryIconFactory.java:61: 错误: 找不到符号
              mImportantConversationColor = context.getColor(R.color.important_conversation);
                                                                    ^
        符号: 变量 important_conversation
        位置: 类 color
      G:\workspace\AndroidS\S_SystemUI\src\com\android\systemui\shared\plugins\PluginManagerImpl.java:85: 错误: 找不到符号
                      Thread.getUncaughtExceptionPreHandler(), initializer);
                            ^
        符号: 方法 getUncaughtExceptionPreHandler()
        位置: 类 Thread
      G:\workspace\AndroidS\S_SystemUI\src\com\android\systemui\shared\plugins\PluginManagerImpl.java:102: 错误: 找不到符号
              Thread.setUncaughtExceptionPreHandler(uncaughtExceptionHandler);
                    ^
        符号: 方法 setUncaughtExceptionPreHandler(PluginManagerImpl.PluginExceptionHandler)
        位置: 类 Thread
      G:\workspace\AndroidS\S_SystemUI\src\com\android\systemui\statusbar\policy\DateView.java:116: 错误: 找不到符号
                  DateFormat format = DateFormat.getInstanceForSkeleton(mDatePattern, l);
                  ^
        符号: 类 DateFormat
        位置: 类 DateView
      G:\workspace\AndroidS\S_SystemUI\src\com\android\systemui\statusbar\policy\DateView.java:116: 错误: 找不到符号
                  DateFormat format = DateFormat.getInstanceForSkeleton(mDatePattern, l);
                                      ^
        符号: 变量 DateFormat
        位置: 类 DateView
      G:\workspace\AndroidS\S_SystemUI\src\com\android\systemui\statusbar\policy\DateView.java:117: 错误: 找不到符号
                  format.setContext(DisplayContext.CAPITALIZATION_FOR_STANDALONE);
                                    ^
        符号: 变量 DisplayContext
        位置: 类 DateView
      G:\workspace\AndroidS\S_SystemUI\src\com\android\systemui\tv\TvSystemUIFactory.java:31: 错误: 找不到符号
              return DaggerTvGlobalRootComponent.builder()
                     ^
        符号: 变量 DaggerTvGlobalRootComponent
        位置: 类 TvSystemUIFactory
      G:\workspace\AndroidS\S_SystemUI\src\com\android\systemui\util\NotificationChannels.java:105: 错误: 找不到符号
                          context.getString(R.string.notification_channel_tv_pip),
                                                    ^
        符号: 变量 notification_channel_tv_pip
        位置: 类 string
      注: 某些输入文件使用或覆盖了已过时的 API。
      注: 有关详细信息, 请使用 -Xlint:deprecation 重新编译。
      注: 某些输入文件使用了未经检查或不安全的操作。
      注: 有关详细信息, 请使用 -Xlint:unchecked 重新编译。
      35 个错误
      6 个警告

      > Task :compileDebugJavaWithJavac FAILED

      FAILURE: Build failed with an exception.

      * What went wrong:
      Execution failed for task ':compileDebugJavaWithJavac'.
      > Compilation failed; see the compiler error output for details.

      * Try:
      Run with --stacktrace option to get the stack trace. Run with --info or --debug option to get more log output. Run with --scan to get full insights.

      * Get more help at https://help.gradle.org

      BUILD FAILED in 1m 35s

      REGRESSION : Last worked in version 8u301


      FREQUENCY : always


        Attachments

          Activity

            People

            Assignee:
            adev ANUPAM DEV
            Reporter:
            webbuggrp Webbug Group
            Votes:
            0 Vote for this issue
            Watchers:
            2 Start watching this issue

              Dates

              Created:
              Updated:
              Resolved: