Uploaded image for project: 'JDK'
  1. JDK
  2. JDK-8271346

com/sun/jdi/EATests.java#id0 failed with "Unexpected exception in test case EAPopFrameNotInlinedReallocFailure"

    XMLWordPrintable

    Details

    • Type: Bug
    • Status: Open
    • Priority: P4
    • Resolution: Unresolved
    • Affects Version/s: 17, 18
    • Fix Version/s: tbd
    • Component/s: core-svc
    • Subcomponent:
    • CPU:
      aarch64
    • OS:
      linux

      Description

      The following test failed in the JDK17 CI:

      com/sun/jdi/EATests.java#id0

      Here's a snippet from the log file:

      ----------System.err:(59/3446)----------
      [3ms] run args: [-XX:+UnlockDiagnosticVMOptions, -Xms256m, -Xmx256m, -Xbootclasspath/a:., -XX:CompileCommand=dontinline,*::dontinline_*, -XX:+WhiteBoxAPI, -Xbatch, -XX:+DoEscapeAnalysis, -XX:+EliminateAllocations, -XX:+EliminateLocks, -XX:+EliminateNestedLocks, -XX:-UseBiasedLocking, EATestsTarget]
      [944ms] EAMaterializeLocalVariableUponGet: passed
      [1015ms] EAGetWithoutMaterialize: passed
      [1082ms] EAMaterializeLocalAtObjectReturn: passed
      [1332ms] EAMaterializeLocalAtObjectPollReturnReturn: passed
      [1375ms] EAMaterializeIntArray: passed
      [1423ms] EAMaterializeLongArray: passed
      [1472ms] EAMaterializeFloatArray: passed
      [1519ms] EAMaterializeDoubleArray: passed
      [1569ms] EAMaterializeObjectArray: passed
      [1630ms] EAMaterializeObjectWithConstantAndNotConstantValues: passed
      [1687ms] EAMaterializeObjReferencedBy2Locals: passed
      [1749ms] EAMaterializeObjReferencedBy2LocalsAndModify: passed
      [1795ms] EAMaterializeObjReferencedBy2LocalsInDifferentVirtFrames: passed
      [1843ms] EAMaterializeObjReferencedBy2LocalsInDifferentVirtFramesAndModify: passed
      [1891ms] EAMaterializeObjReferencedFromOperandStack: passed
      [1940ms] EAMaterializeLocalVariableUponGetAfterSetInteger: passed
      [1987ms] EARelockingSimple: passed
      [2038ms] EARelockingSimple_2: passed
      [2096ms] EARelockingRecursive: passed
      [2151ms] EARelockingNestedInflated: passed
      [2212ms] EARelockingNestedInflated_02: passed
      [2268ms] EARelockingArgEscapeLWLockedInCalleeFrame: passed
      [2317ms] EARelockingArgEscapeLWLockedInCalleeFrame_2: passed
      [2410ms] EARelockingArgEscapeLWLockedInCalleeFrame_3: passed
      [2474ms] EARelockingArgEscapeLWLockedInCalleeFrame_4: passed
      [2504ms] EAGetOwnedMonitors: passed
      [2536ms] EAEntryCount: passed
      [2794ms] EARelockingObjectCurrentlyWaitingOn: passed
      [2842ms] EADeoptFrameAfterReadLocalObject_01: passed
      [2899ms] EADeoptFrameAfterReadLocalObject_01B: passed
      [3162ms] EADeoptFrameAfterReadLocalObject_02: passed
      [3241ms] EADeoptFrameAfterReadLocalObject_02B: passed
      [3283ms] EADeoptFrameAfterReadLocalObject_02C: passed
      [3348ms] EADeoptFrameAfterReadLocalObject_03: passed
      [3394ms] EAPopFrameNotInlined: passed
      java.lang.RuntimeException: Unexpected exception in test case EAPopFrameNotInlinedReallocFailure
      at jdk.test.lib.Asserts.fail(Asserts.java:617)
      at EATestCaseBaseDebugger.run(EATests.java:447)
      at EATests.runTests(EATests.java:376)
      at TestScaffold.startTests(TestScaffold.java:431)
      at EATests.main(EATests.java:292)
      at java.base/jdk.internal.reflect.NativeMethodAccessorImpl.invoke0(Native Method)
      at java.base/jdk.internal.reflect.NativeMethodAccessorImpl.invoke(NativeMethodAccessorImpl.java:77)
      at java.base/jdk.internal.reflect.DelegatingMethodAccessorImpl.invoke(DelegatingMethodAccessorImpl.java:43)
      at java.base/java.lang.reflect.Method.invoke(Method.java:568)
      at com.sun.javatest.regtest.agent.MainActionHelper$AgentVMRunnable.run(MainActionHelper.java:312)
      at java.base/java.lang.Thread.run(Thread.java:833)
      Caused by: java.lang.RuntimeException: PopFrame should have triggered an OOM exception in target: expected true, was false
      at jdk.test.lib.Asserts.fail(Asserts.java:594)
      at jdk.test.lib.Asserts.assertTrue(Asserts.java:486)
      at EAPopFrameNotInlinedReallocFailure.runTestCase(EATests.java:2631)
      at EATestCaseBaseDebugger.run(EATests.java:442)
      ... 9 more

      JavaTest Message: Test threw exception: java.lang.RuntimeException
      JavaTest Message: shutting down test

      IOException reading output of child java interpreter:Stream closed
      result: Failed. Execution failed: `main' threw exception: java.lang.RuntimeException: Unexpected exception in test case EAPopFrameNotInlinedReallocFailure

      The test task's JVM args are:

      -XX:+CreateCoredumpOnCrash -XX:+UseSerialGC

        Attachments

          Activity

            People

            Assignee:
            Unassigned Unassigned
            Reporter:
            dcubed Daniel Daugherty
            Votes:
            0 Vote for this issue
            Watchers:
            2 Start watching this issue

              Dates

              Created:
              Updated: