Uploaded image for project: 'JDK'
  1. JDK
  2. JDK-8272700

[macos] Build failure with Xcode 13.0 after JDK-8264848

    XMLWordPrintable

    Details

    • Subcomponent:
    • Resolved In Build:
      b12

      Backports

        Description

        Compiling 56 files for java.sql.rowset
        Compiling 82 files for jdk.jlink
        Compiling 95 files for jdk.jshell
        error: invalid integral value '16-DMAC_OS_X_VERSION_MIN_REQUIRED=10120' in '-mstack-alignment=16-DMAC_OS_X_VERSION_MIN_REQUIRED=10120'
        make[3]: *** [/Users/jdk/build/macosx-x86_64-server-fastdebug/hotspot/variant-server/libjvm/objs/bsd_x86_64.o] Error 1
        make[3]: *** Waiting for unfinished jobs....
        Compiling 229 files for jdk.javadoc
        make[2]: *** [hotspot-server-libs] Error 2
        make[2]: *** Waiting for unfinished jobs....
        Compiling 2736 files for java.desktop

        ERROR: Build failed for target 'images' in configuration 'macosx-x86_64-server-fastdebug' (exit code 2)
        Stopping sjavac server

        make[1]: *** [main] Error 2
        === Output from failing command(s) repeated here ===
        make: *** [images] Error 2
        * For target hotspot_variant-server_libjvm_objs_bsd_x86_64.o:
        error: invalid integral value '16-DMAC_OS_X_VERSION_MIN_REQUIRED=10120' in '-mstack-alignment=16-DMAC_OS_X_VERSION_MIN_REQUIRED=10120'

        * All command lines available in /Users/jdk/build/macosx-x86_64-server-fastdebug/make-support/failure-logs.
        === End of repeated output ===

          Attachments

            Issue Links

              Activity

                People

                Assignee:
                jiefu Jie Fu
                Reporter:
                jiefu Jie Fu
                Votes:
                0 Vote for this issue
                Watchers:
                5 Start watching this issue

                  Dates

                  Created:
                  Updated:
                  Resolved: