Uploaded image for project: 'JDK'
  1. JDK
  2. JDK-8274152

sanity/client/SwingSet tests fail on Mac_OS_X_11.6

    XMLWordPrintable

    Details

    • Subcomponent:
    • CPU:
      x86_64
    • OS:
      linux, os_x

      Description

      The following tests failed in JDK18 CI:

      sanity/client/SwingSet/src/SliderDemoTest.java
      sanity/client/SwingSet/src/OptionPaneDemoTest.java
      sanity/client/SwingSet/src/EditorPaneDemoTest.java
      sanity/client/SwingSet/src/ColorChooserDemoTest.java

      Here's a snippet from the SliderDemoTest.java log file:

      ----------System.out:(220/20005)----------
      Using org.netbeans.jemmy.drivers.APIDriverInstaller driver installer
      config SliderDemoTest.useKeyboardSliderDriver(): success
      Trace:
      Start to wait frame "Frame with title "Slider Demo"" opened
      Trace:
      Frame "Frame with title "Slider Demo"" has been opened in 1 milliseconds
          javax.swing.JFrame[frame0,560,236,800x600,layout=java.awt.BorderLayout,title=Slider Demo,resizable,normal,defaultCloseOperation=EXIT_ON_CLOSE,rootPane=javax.swing.JRootPane[,0,28,800x572,layout=javax.swing.JRootPane$RootLayout,alignmentX=0.0,alignmentY=0.0,border=,flags=16777673,maximumSize=,minimumSize=,preferredSize=],rootPaneCheckingEnabled=true]
      Waiting for "JComponent with "Horizontal Plain Slider" accessible name" subcomponent
      Trace:
      Start to wait action "Wait for "JComponent with "Horizontal Plain Slider" accessible name" subcomponent to be displayed (ComponentOperator.WaitComponentTimeout)"
      Trace:
      "Wait for "JComponent with "Horizontal Plain Slider" accessible name" subcomponent to be displayed (ComponentOperator.WaitComponentTimeout)" action has been produced in 11 milliseconds with result
          : javax.swing.JSlider[,5,22,375x16,alignmentX=0.0,alignmentY=0.0,border=,flags=296,maximumSize=,minimumSize=,preferredSize=,isInverted=false,majorTickSpacing=0,minorTickSpacing=0,orientation=HORIZONTAL,paintLabels=false,paintTicks=false,paintTrack=true,snapToTicks=false,snapToValue=true]
      Saving screenshot to /System/Volumes/Data/mesos/work_dir/slaves/a2dc162d-743b-4800-9e92-31f85abb45b1-S6999/frameworks/1735e8a2-a1db-478c-8104-60c8b0af87dd-0196/executors/5140e7d0-2735-4630-be2c-b78d1ee4f13e/runs/0a5d494f-4f1e-4cb8-8cfc-8bc7636b9fa1/testoutput/test-support/jtreg_open_test_jdk_jdk_client_sanity/sanity/client/SwingSet/src/SliderDemoTest/failure-MetalLookAndFeel-20210922143025.png
      Saving screenshot to /System/Volumes/Data/mesos/work_dir/slaves/a2dc162d-743b-4800-9e92-31f85abb45b1-S6999/frameworks/1735e8a2-a1db-478c-8104-60c8b0af87dd-0196/executors/5140e7d0-2735-4630-be2c-b78d1ee4f13e/runs/0a5d494f-4f1e-4cb8-8cfc-8bc7636b9fa1/testoutput/test-support/jtreg_open_test_jdk_jdk_client_sanity/sanity/client/SwingSet/src/SliderDemoTest/window-0-MetalLookAndFeel-20210922143025.png
      disposeAllWindows
      test SliderDemoTest.test("javax.swing.plaf.metal.MetalLookAndFeel"): failure
      org.netbeans.jemmy.TimeoutExpiredException: Wait component has focus (ComponentOperator.WaitFocusTimeout)
      at org.netbeans.jemmy.Waiter.waitAction(Waiter.java:210)
      at org.netbeans.jemmy.operators.ComponentOperator.waitHasFocus(ComponentOperator.java:1107)
      at SliderDemoTest.plain(SliderDemoTest.java:98)
      at SliderDemoTest.test(SliderDemoTest.java:84)
      at java.base/jdk.internal.reflect.NativeMethodAccessorImpl.invoke0(Native Method)
      at java.base/jdk.internal.reflect.NativeMethodAccessorImpl.invoke(NativeMethodAccessorImpl.java:77)
      at java.base/jdk.internal.reflect.DelegatingMethodAccessorImpl.invoke(DelegatingMethodAccessorImpl.java:43)
      at java.base/java.lang.reflect.Method.invoke(Method.java:568)
      at org.testng.internal.MethodInvocationHelper.invokeMethod(MethodInvocationHelper.java:132)
      at org.testng.internal.TestInvoker.invokeMethod(TestInvoker.java:599)
      at org.testng.internal.TestInvoker.invokeTestMethod(TestInvoker.java:174)
      at org.testng.internal.MethodRunner.runInSequence(MethodRunner.java:46)
      at org.testng.internal.TestInvoker$MethodInvocationAgent.invoke(TestInvoker.java:822)
      at org.testng.internal.TestInvoker.invokeTestMethods(TestInvoker.java:147)
      at org.testng.internal.TestMethodWorker.invokeTestMethods(TestMethodWorker.java:146)
      at org.testng.internal.TestMethodWorker.run(TestMethodWorker.java:128)
      at java.base/java.util.ArrayList.forEach(ArrayList.java:1511)
      at org.testng.TestRunner.privateRun(TestRunner.java:764)
      at org.testng.TestRunner.run(TestRunner.java:585)
      at org.testng.SuiteRunner.runTest(SuiteRunner.java:384)
      at org.testng.SuiteRunner.runSequentially(SuiteRunner.java:378)
      at org.testng.SuiteRunner.privateRun(SuiteRunner.java:337)
      at org.testng.SuiteRunner.run(SuiteRunner.java:286)
      at org.testng.SuiteRunnerWorker.runSuite(SuiteRunnerWorker.java:53)
      at org.testng.SuiteRunnerWorker.run(SuiteRunnerWorker.java:96)
      at org.testng.TestNG.runSuitesSequentially(TestNG.java:1218)
      at org.testng.TestNG.runSuitesLocally(TestNG.java:1140)
      at org.testng.TestNG.runSuites(TestNG.java:1069)
      at org.testng.TestNG.run(TestNG.java:1037)
      at com.sun.javatest.regtest.agent.TestNGRunner.main(TestNGRunner.java:94)
      at com.sun.javatest.regtest.agent.TestNGRunner.main(TestNGRunner.java:54)
      at java.base/jdk.internal.reflect.NativeMethodAccessorImpl.invoke0(Native Method)
      at java.base/jdk.internal.reflect.NativeMethodAccessorImpl.invoke(NativeMethodAccessorImpl.java:77)
      at java.base/jdk.internal.reflect.DelegatingMethodAccessorImpl.invoke(DelegatingMethodAccessorImpl.java:43)
      at java.base/java.lang.reflect.Method.invoke(Method.java:568)
      at com.sun.javatest.regtest.agent.MainWrapper$MainThread.run(MainWrapper.java:127)
      at java.base/java.lang.Thread.run(Thread.java:833)


      Here's a snippet from the OptionPaneDemoTest.java log file:

      javax.swing.JDialog[dialog0,814,489,291x121,layout=java.awt.BorderLayout,APPLICATION_MODAL,title=Input,defaultCloseOperation=HIDE_ON_CLOSE,rootPane=javax.swing.JRootPane[,0,28,291x93,layout=javax.swing.JRootPane$RootLayout,alignmentX=0.0,alignmentY=0.0,border=,flags=16777673,maximumSize=,minimumSize=,preferredSize=],rootPaneCheckingEnabled=true]
      Saving screenshot to /System/Volumes/Data/mesos/work_dir/slaves/a2dc162d-743b-4800-9e92-31f85abb45b1-S6999/frameworks/1735e8a2-a1db-478c-8104-60c8b0af87dd-0196/executors/5140e7d0-2735-4630-be2c-b78d1ee4f13e/runs/0a5d494f-4f1e-4cb8-8cfc-8bc7636b9fa1/testoutput/test-support/jtreg_open_test_jdk_jdk_client_sanity/sanity/client/SwingSet/src/OptionPaneDemoTest/failure-MetalLookAndFeel-20210922142609.png
      Saving screenshot to /System/Volumes/Data/mesos/work_dir/slaves/a2dc162d-743b-4800-9e92-31f85abb45b1-S6999/frameworks/1735e8a2-a1db-478c-8104-60c8b0af87dd-0196/executors/5140e7d0-2735-4630-be2c-b78d1ee4f13e/runs/0a5d494f-4f1e-4cb8-8cfc-8bc7636b9fa1/testoutput/test-support/jtreg_open_test_jdk_jdk_client_sanity/sanity/client/SwingSet/src/OptionPaneDemoTest/window-0-MetalLookAndFeel-20210922142610.png
      Saving screenshot to /System/Volumes/Data/mesos/work_dir/slaves/a2dc162d-743b-4800-9e92-31f85abb45b1-S6999/frameworks/1735e8a2-a1db-478c-8104-60c8b0af87dd-0196/executors/5140e7d0-2735-4630-be2c-b78d1ee4f13e/runs/0a5d494f-4f1e-4cb8-8cfc-8bc7636b9fa1/testoutput/test-support/jtreg_open_test_jdk_jdk_client_sanity/sanity/client/SwingSet/src/OptionPaneDemoTest/window-1-MetalLookAndFeel-20210922142610.png
      disposeAllWindows
      test OptionPaneDemoTest.test("javax.swing.plaf.metal.MetalLookAndFeel"): failure
      org.netbeans.jemmy.TimeoutExpiredException: Text typing (JTextComponentOperator.TypeTextTimeout)
      at org.netbeans.jemmy.Waiter.waitAction(Waiter.java:210)
      at org.netbeans.jemmy.ActionProducer.produceAction(ActionProducer.java:265)
      at org.netbeans.jemmy.operators.Operator.produceTimeRestricted(Operator.java:776)
      at org.netbeans.jemmy.operators.Operator.produceTimeRestricted(Operator.java:801)
      at org.netbeans.jemmy.operators.JTextComponentOperator.typeText(JTextComponentOperator.java:565)
      at org.netbeans.jemmy.operators.JTextComponentOperator.typeText(JTextComponentOperator.java:595)
      at OptionPaneDemoTest.useInputDialog(OptionPaneDemoTest.java:100)
      at OptionPaneDemoTest.showInputDialog(OptionPaneDemoTest.java:109)
      at OptionPaneDemoTest.test(OptionPaneDemoTest.java:81)
      at java.base/jdk.internal.reflect.NativeMethodAccessorImpl.invoke0(Native Method)
      at java.base/jdk.internal.reflect.NativeMethodAccessorImpl.invoke(NativeMethodAccessorImpl.java:77)
      at java.base/jdk.internal.reflect.DelegatingMethodAccessorImpl.invoke(DelegatingMethodAccessorImpl.java:43)
      at java.base/java.lang.reflect.Method.invoke(Method.java:568)
      at org.testng.internal.MethodInvocationHelper.invokeMethod(MethodInvocationHelper.java:132)
      at org.testng.internal.TestInvoker.invokeMethod(TestInvoker.java:599)
      at org.testng.internal.TestInvoker.invokeTestMethod(TestInvoker.java:174)
      at org.testng.internal.MethodRunner.runInSequence(MethodRunner.java:46)
      at org.testng.internal.TestInvoker$MethodInvocationAgent.invoke(TestInvoker.java:822)
      at org.testng.internal.TestInvoker.invokeTestMethods(TestInvoker.java:147)
      at org.testng.internal.TestMethodWorker.invokeTestMethods(TestMethodWorker.java:146)
      at org.testng.internal.TestMethodWorker.run(TestMethodWorker.java:128)
      at java.base/java.util.ArrayList.forEach(ArrayList.java:1511)
      at org.testng.TestRunner.privateRun(TestRunner.java:764)
      at org.testng.TestRunner.run(TestRunner.java:585)
      at org.testng.SuiteRunner.runTest(SuiteRunner.java:384)
      at org.testng.SuiteRunner.runSequentially(SuiteRunner.java:378)
      at org.testng.SuiteRunner.privateRun(SuiteRunner.java:337)
      at org.testng.SuiteRunner.run(SuiteRunner.java:286)
      at org.testng.SuiteRunnerWorker.runSuite(SuiteRunnerWorker.java:53)
      at org.testng.SuiteRunnerWorker.run(SuiteRunnerWorker.java:96)
      at org.testng.TestNG.runSuitesSequentially(TestNG.java:1218)
      at org.testng.TestNG.runSuitesLocally(TestNG.java:1140)
      at org.testng.TestNG.runSuites(TestNG.java:1069)
      at org.testng.TestNG.run(TestNG.java:1037)
      at com.sun.javatest.regtest.agent.TestNGRunner.main(TestNGRunner.java:94)
      at com.sun.javatest.regtest.agent.TestNGRunner.main(TestNGRunner.java:54)
      at java.base/jdk.internal.reflect.NativeMethodAccessorImpl.invoke0(Native Method)
      at java.base/jdk.internal.reflect.NativeMethodAccessorImpl.invoke(NativeMethodAccessorImpl.java:77)
      at java.base/jdk.internal.reflect.DelegatingMethodAccessorImpl.invoke(DelegatingMethodAccessorImpl.java:43)
      at java.base/java.lang.reflect.Method.invoke(Method.java:568)
      at com.sun.javatest.regtest.agent.MainWrapper$MainThread.run(MainWrapper.java:127)
      at java.base/java.lang.Thread.run(Thread.java:833)


      Here's a snippet from the EditorPaneDemoTest.java log file:

      javax.swing.JEditorPane[,0,0,782x1120,layout=javax.swing.plaf.basic.BasicTextUI$UpdateHandler,alignmentX=0.0,alignmentY=0.0,border=javax.swing.plaf.basic.BasicBorders$MarginBorder@3ffd45d5,flags=296,maximumSize=,minimumSize=,preferredSize=,caretColor=sun.swing.PrintColorUIResource[r=51,g=51,b=51],disabledTextColor=javax.swing.plaf.ColorUIResource[r=184,g=207,b=229],editable=false,margin=javax.swing.plaf.InsetsUIResource[top=3,left=3,bottom=3,right=3],selectedTextColor=sun.swing.PrintColorUIResource[r=51,g=51,b=51],selectionColor=javax.swing.plaf.ColorUIResource[r=184,g=207,b=229],kit=javax.swing.text.html.HTMLEditorKit@2c1decfd,typeHandlers={text/html=javax.swing.text.html.HTMLEditorKit@2c1decfd}]
      Saving screenshot to /System/Volumes/Data/mesos/work_dir/slaves/a2dc162d-743b-4800-9e92-31f85abb45b1-S6999/frameworks/1735e8a2-a1db-478c-8104-60c8b0af87dd-0196/executors/5140e7d0-2735-4630-be2c-b78d1ee4f13e/runs/0a5d494f-4f1e-4cb8-8cfc-8bc7636b9fa1/testoutput/test-support/jtreg_open_test_jdk_jdk_client_sanity/sanity/client/SwingSet/src/EditorPaneDemoTest/editor-MetalLookAndFeel-20210922142450.png
      Saving screenshot to /System/Volumes/Data/mesos/work_dir/slaves/a2dc162d-743b-4800-9e92-31f85abb45b1-S6999/frameworks/1735e8a2-a1db-478c-8104-60c8b0af87dd-0196/executors/5140e7d0-2735-4630-be2c-b78d1ee4f13e/runs/0a5d494f-4f1e-4cb8-8cfc-8bc7636b9fa1/testoutput/test-support/jtreg_open_test_jdk_jdk_client_sanity/sanity/client/SwingSet/src/EditorPaneDemoTest/failure-MetalLookAndFeel-20210922142451.png
      Saving screenshot to /System/Volumes/Data/mesos/work_dir/slaves/a2dc162d-743b-4800-9e92-31f85abb45b1-S6999/frameworks/1735e8a2-a1db-478c-8104-60c8b0af87dd-0196/executors/5140e7d0-2735-4630-be2c-b78d1ee4f13e/runs/0a5d494f-4f1e-4cb8-8cfc-8bc7636b9fa1/testoutput/test-support/jtreg_open_test_jdk_jdk_client_sanity/sanity/client/SwingSet/src/EditorPaneDemoTest/window-0-MetalLookAndFeel-20210922142451.png
      disposeAllWindows
      test EditorPaneDemoTest.test("javax.swing.plaf.metal.MetalLookAndFeel"): failure
      java.lang.AssertionError: image blackness expected [false] but found [true]
      at org.testng.Assert.fail(Assert.java:99)
      at org.testng.Assert.failNotEquals(Assert.java:1037)
      at org.testng.Assert.assertFalse(Assert.java:67)
      at EditorPaneDemoTest.lambda$checkImage$4(EditorPaneDemoTest.java:153)
      at org.netbeans.jemmy.operators.Operator$1.actionProduced(Operator.java:699)
      at org.netbeans.jemmy.operators.Operator$1.actionProduced(Operator.java:696)
      at org.netbeans.jemmy.Waiter.actionProduced(Waiter.java:231)
      at org.netbeans.jemmy.Waiter.waitAction(Waiter.java:205)
      at org.netbeans.jemmy.operators.Operator.waitState(Operator.java:721)
      at org.netbeans.jemmy.operators.Operator.waitState(Operator.java:696)
      at EditorPaneDemoTest.checkImage(EditorPaneDemoTest.java:150)
      at EditorPaneDemoTest.test(EditorPaneDemoTest.java:110)
      at java.base/jdk.internal.reflect.NativeMethodAccessorImpl.invoke0(Native Method)
      at java.base/jdk.internal.reflect.NativeMethodAccessorImpl.invoke(NativeMethodAccessorImpl.java:77)
      at java.base/jdk.internal.reflect.DelegatingMethodAccessorImpl.invoke(DelegatingMethodAccessorImpl.java:43)
      at java.base/java.lang.reflect.Method.invoke(Method.java:568)
      at org.testng.internal.MethodInvocationHelper.invokeMethod(MethodInvocationHelper.java:132)
      at org.testng.internal.TestInvoker.invokeMethod(TestInvoker.java:599)
      at org.testng.internal.TestInvoker.invokeTestMethod(TestInvoker.java:174)
      at org.testng.internal.MethodRunner.runInSequence(MethodRunner.java:46)
      at org.testng.internal.TestInvoker$MethodInvocationAgent.invoke(TestInvoker.java:822)
      at org.testng.internal.TestInvoker.invokeTestMethods(TestInvoker.java:147)
      at org.testng.internal.TestMethodWorker.invokeTestMethods(TestMethodWorker.java:146)
      at org.testng.internal.TestMethodWorker.run(TestMethodWorker.java:128)
      at java.base/java.util.ArrayList.forEach(ArrayList.java:1511)
      at org.testng.TestRunner.privateRun(TestRunner.java:764)
      at org.testng.TestRunner.run(TestRunner.java:585)
      at org.testng.SuiteRunner.runTest(SuiteRunner.java:384)
      at org.testng.SuiteRunner.runSequentially(SuiteRunner.java:378)
      at org.testng.SuiteRunner.privateRun(SuiteRunner.java:337)
      at org.testng.SuiteRunner.run(SuiteRunner.java:286)
      at org.testng.SuiteRunnerWorker.runSuite(SuiteRunnerWorker.java:53)
      at org.testng.SuiteRunnerWorker.run(SuiteRunnerWorker.java:96)
      at org.testng.TestNG.runSuitesSequentially(TestNG.java:1218)
      at org.testng.TestNG.runSuitesLocally(TestNG.java:1140)
      at org.testng.TestNG.runSuites(TestNG.java:1069)
      at org.testng.TestNG.run(TestNG.java:1037)
      at com.sun.javatest.regtest.agent.TestNGRunner.main(TestNGRunner.java:94)
      at com.sun.javatest.regtest.agent.TestNGRunner.main(TestNGRunner.java:54)
      at java.base/jdk.internal.reflect.NativeMethodAccessorImpl.invoke0(Native Method)
      at java.base/jdk.internal.reflect.NativeMethodAccessorImpl.invoke(NativeMethodAccessorImpl.java:77)
      at java.base/jdk.internal.reflect.DelegatingMethodAccessorImpl.invoke(DelegatingMethodAccessorImpl.java:43)
      at java.base/java.lang.reflect.Method.invoke(Method.java:568)
      at com.sun.javatest.regtest.agent.MainWrapper$MainThread.run(MainWrapper.java:127)
      at java.base/java.lang.Thread.run(Thread.java:833)


      Here's a snippet from the ColorChooserDemoTest.java log file:

      javax.swing.JButton[,330,0,95x26,alignmentX=0.0,alignmentY=0.5,border=com.apple.laf.AquaButtonBorder$Toggle@708f82d1,flags=288,maximumSize=,minimumSize=,preferredSize=,defaultIcon=com.sun.swingset3.demos.colorchooser.ColorChooserDemo$ColorSwatch@33cf2c75,disabledIcon=,disabledSelectedIcon=,margin=javax.swing.plaf.InsetsUIResource[top=0,left=2,bottom=0,right=2],paintBorder=true,paintFocus=true,pressedIcon=,rolloverEnabled=false,rolloverIcon=,rolloverSelectedIcon=,selectedIcon=,text=Perimeter,defaultCapable=true]
      Saving screenshot to /System/Volumes/Data/mesos/work_dir/slaves/a2dc162d-743b-4800-9e92-31f85abb45b1-S6999/frameworks/1735e8a2-a1db-478c-8104-60c8b0af87dd-0196/executors/5140e7d0-2735-4630-be2c-b78d1ee4f13e/runs/0a5d494f-4f1e-4cb8-8cfc-8bc7636b9fa1/testoutput/test-support/jtreg_open_test_jdk_jdk_client_sanity/sanity/client/SwingSet/src/ColorChooserDemoTest/failure-AquaLookAndFeel-20210922142439.png
      Saving screenshot to /System/Volumes/Data/mesos/work_dir/slaves/a2dc162d-743b-4800-9e92-31f85abb45b1-S6999/frameworks/1735e8a2-a1db-478c-8104-60c8b0af87dd-0196/executors/5140e7d0-2735-4630-be2c-b78d1ee4f13e/runs/0a5d494f-4f1e-4cb8-8cfc-8bc7636b9fa1/testoutput/test-support/jtreg_open_test_jdk_jdk_client_sanity/sanity/client/SwingSet/src/ColorChooserDemoTest/window-0-AquaLookAndFeel-20210922142439.png
      disposeAllWindows
      test ColorChooserDemoTest.test(): failure
      org.netbeans.jemmy.TimeoutExpiredException: Wait component has focus (ComponentOperator.WaitFocusTimeout)
      at org.netbeans.jemmy.Waiter.waitAction(Waiter.java:210)
      at org.netbeans.jemmy.operators.ComponentOperator.waitHasFocus(ComponentOperator.java:1107)
      at ColorChooserDemoTest.pushButtonAndInitialize(ColorChooserDemoTest.java:150)
      at ColorChooserDemoTest.checkDefaultColorChooser(ColorChooserDemoTest.java:186)
      at ColorChooserDemoTest.basicCheck(ColorChooserDemoTest.java:178)
      at ColorChooserDemoTest.checkBackgroundColorChooser(ColorChooserDemoTest.java:132)
      at ColorChooserDemoTest.test(ColorChooserDemoTest.java:125)
      at java.base/jdk.internal.reflect.NativeMethodAccessorImpl.invoke0(Native Method)
      at java.base/jdk.internal.reflect.NativeMethodAccessorImpl.invoke(NativeMethodAccessorImpl.java:77)
      at java.base/jdk.internal.reflect.DelegatingMethodAccessorImpl.invoke(DelegatingMethodAccessorImpl.java:43)
      at java.base/java.lang.reflect.Method.invoke(Method.java:568)
      at org.testng.internal.MethodInvocationHelper.invokeMethod(MethodInvocationHelper.java:132)
      at org.testng.internal.TestInvoker.invokeMethod(TestInvoker.java:599)
      at org.testng.internal.TestInvoker.invokeTestMethod(TestInvoker.java:174)
      at org.testng.internal.MethodRunner.runInSequence(MethodRunner.java:46)
      at org.testng.internal.TestInvoker$MethodInvocationAgent.invoke(TestInvoker.java:822)
      at org.testng.internal.TestInvoker.invokeTestMethods(TestInvoker.java:147)
      at org.testng.internal.TestMethodWorker.invokeTestMethods(TestMethodWorker.java:146)
      at org.testng.internal.TestMethodWorker.run(TestMethodWorker.java:128)
      at java.base/java.util.ArrayList.forEach(ArrayList.java:1511)
      at org.testng.TestRunner.privateRun(TestRunner.java:764)
      at org.testng.TestRunner.run(TestRunner.java:585)
      at org.testng.SuiteRunner.runTest(SuiteRunner.java:384)
      at org.testng.SuiteRunner.runSequentially(SuiteRunner.java:378)
      at org.testng.SuiteRunner.privateRun(SuiteRunner.java:337)
      at org.testng.SuiteRunner.run(SuiteRunner.java:286)
      at org.testng.SuiteRunnerWorker.runSuite(SuiteRunnerWorker.java:53)
      at org.testng.SuiteRunnerWorker.run(SuiteRunnerWorker.java:96)
      at org.testng.TestNG.runSuitesSequentially(TestNG.java:1218)
      at org.testng.TestNG.runSuitesLocally(TestNG.java:1140)
      at org.testng.TestNG.runSuites(TestNG.java:1069)
      at org.testng.TestNG.run(TestNG.java:1037)
      at com.sun.javatest.regtest.agent.TestNGRunner.main(TestNGRunner.java:94)
      at com.sun.javatest.regtest.agent.TestNGRunner.main(TestNGRunner.java:54)
      at java.base/jdk.internal.reflect.NativeMethodAccessorImpl.invoke0(Native Method)
      at java.base/jdk.internal.reflect.NativeMethodAccessorImpl.invoke(NativeMethodAccessorImpl.java:77)
      at java.base/jdk.internal.reflect.DelegatingMethodAccessorImpl.invoke(DelegatingMethodAccessorImpl.java:43)
      at java.base/java.lang.reflect.Method.invoke(Method.java:568)
      at com.sun.javatest.regtest.agent.MainWrapper$MainThread.run(MainWrapper.java:127)
      at java.base/java.lang.Thread.run(Thread.java:833)

        Attachments

          Issue Links

            Activity

              People

              Assignee:
              shurailine Aleksandre Iline
              Reporter:
              dcubed Daniel Daugherty
              Votes:
              0 Vote for this issue
              Watchers:
              8 Start watching this issue

                Dates

                Created:
                Updated: