Uploaded image for project: 'JDK'
  1. JDK
  2. JDK-8276082

`java.lang.AssertionError: isSubClass P` on building NSA Ghidra 91c07fd commit

    XMLWordPrintable

    Details

    • Subcomponent:
    • CPU:
      generic
    • OS:
      generic

      Description

      ADDITIONAL SYSTEM INFORMATION :
      Fedora 35
      [i] ℤ uname -a 15:40:43
      Linux user-linux 5.14.10-300.fc35.x86_64 #1 SMP Thu Oct 7 20:48:44 UTC 2021 x86_64 x86_64 x86_64 GNU/Linux
      Ghidra on  master [$]
      [i] ℤ java --version 15:44:33
      openjdk 17 2021-09-14
      OpenJDK Runtime Environment 21.9 (build 17+35)
      OpenJDK 64-Bit Server VM 21.9 (build 17+35, mixed mode, sharing)

      [i] ℤ gradle --version 15:46:02

      ------------------------------------------------------------
      Gradle 7.2
      ------------------------------------------------------------

      Build time: 2021-08-17 09:59:03 UTC
      Revision: a773786b58bb28710e3dc96c4d1a7063628952ad

      Kotlin: 1.5.21
      Groovy: 3.0.8
      Ant: Apache Ant(TM) version 1.10.9 compiled on September 27 2020
      JVM: 17 (Red Hat, Inc. 17+35)
      OS: Linux 5.14.10-300.fc35.x86_64 amd64


      A DESCRIPTION OF THE PROBLEM :
      When I ran `gradle buildGhidra --warning-mode all --stacktrace` I get the following error
      The Ghidra commit is this one https://github.com/NationalSecurityAgency/ghidra/commit/91c07fd933c2435870a267aea16a50d257b77639
       
      ```
      > Task :SoftwareModeling:compileJava
      Note: Some input files use or override a deprecated API.
      Note: Recompile with -Xlint:deprecation for details.
      Note: Some input files use or override a deprecated API that is marked for removal.
      Note: Recompile with -Xlint:removal for details.
      An exception has occurred in the compiler (17). Please file a bug against the Java compiler via the Java bug reporting page (http://bugreport.java.com) after checking the Bug Database (http://bugs.java.com) for duplicates. Include your program, the following diagnostic, and the parameters passed to the Java compiler in your report. Thank you.
      java.lang.AssertionError: isSubClass P
              at jdk.compiler/com.sun.tools.javac.code.Symbol.isSubClass(Symbol.java:546)
              at jdk.compiler/com.sun.tools.javac.code.Symbol.isMemberOf(Symbol.java:555)
              at jdk.compiler/com.sun.tools.javac.code.Symbol$MethodSymbol.overrides(Symbol.java:2092)
              at jdk.compiler/com.sun.tools.javac.code.Symbol$MethodSymbol.overrides(Symbol.java:2052)
              at jdk.compiler/com.sun.tools.javac.code.Types$ImplementationCache.implementationInternal(Types.java:2984)
              at jdk.compiler/com.sun.tools.javac.code.Types$ImplementationCache.get(Types.java:2969)
              at jdk.compiler/com.sun.tools.javac.code.Types.implementation(Types.java:3004)
              at jdk.compiler/com.sun.tools.javac.code.Symbol$MethodSymbol.implementation(Symbol.java:2159)
              at jdk.compiler/com.sun.tools.javac.code.Symbol$MethodSymbol.implementation(Symbol.java:2152)
              at jdk.compiler/com.sun.tools.javac.comp.Resolve.notOverriddenIn(Resolve.java:471)
              at jdk.compiler/com.sun.tools.javac.comp.Resolve.selectBest(Resolve.java:1572)
              at jdk.compiler/com.sun.tools.javac.comp.Resolve.findMethodInScope(Resolve.java:1788)
              at jdk.compiler/com.sun.tools.javac.comp.Resolve.findMethod(Resolve.java:1879)
              at jdk.compiler/com.sun.tools.javac.comp.Resolve.findMethod(Resolve.java:1832)
              at jdk.compiler/com.sun.tools.javac.comp.Resolve$11.doLookup(Resolve.java:2737)
              at jdk.compiler/com.sun.tools.javac.comp.Resolve$BasicLookupHelper.lookup(Resolve.java:3454)
              at jdk.compiler/com.sun.tools.javac.comp.Resolve.lookupMethod(Resolve.java:3704)
              at jdk.compiler/com.sun.tools.javac.comp.Resolve.resolveQualifiedMethod(Resolve.java:2734)
              at jdk.compiler/com.sun.tools.javac.comp.Resolve.resolveInternalMethod(Resolve.java:2828)
              at jdk.compiler/com.sun.tools.javac.comp.Attr.visitForeachLoop(Attr.java:1545)
              at jdk.compiler/com.sun.tools.javac.tree.JCTree$JCEnhancedForLoop.accept(JCTree.java:1231)
              at jdk.compiler/com.sun.tools.javac.comp.Attr.attribTree(Attr.java:674)
              at jdk.compiler/com.sun.tools.javac.comp.Attr.attribStat(Attr.java:748)
              at jdk.compiler/com.sun.tools.javac.comp.Attr.attribStats(Attr.java:767)
              at jdk.compiler/com.sun.tools.javac.comp.Attr.visitBlock(Attr.java:1445)
              at jdk.compiler/com.sun.tools.javac.tree.JCTree$JCBlock.accept(JCTree.java:1091)
              at jdk.compiler/com.sun.tools.javac.comp.Attr.attribTree(Attr.java:674)
              at jdk.compiler/com.sun.tools.javac.comp.Attr.attribStat(Attr.java:748)
              at jdk.compiler/com.sun.tools.javac.comp.Attr.visitMethodDef(Attr.java:1235)
              at jdk.compiler/com.sun.tools.javac.tree.JCTree$JCMethodDecl.accept(JCTree.java:921)
              at jdk.compiler/com.sun.tools.javac.comp.Attr.attribTree(Attr.java:674)
              at jdk.compiler/com.sun.tools.javac.comp.Attr.attribStat(Attr.java:748)
              at jdk.compiler/com.sun.tools.javac.comp.Attr.attribClassBody(Attr.java:5474)
              at jdk.compiler/com.sun.tools.javac.comp.Attr.attribClass(Attr.java:5365)
              at jdk.compiler/com.sun.tools.javac.comp.Attr.attribClass(Attr.java:5196)
              at jdk.compiler/com.sun.tools.javac.comp.Attr.attrib(Attr.java:5141)
              at jdk.compiler/com.sun.tools.javac.main.JavaCompiler.attribute(JavaCompiler.java:1317)
              at jdk.compiler/com.sun.tools.javac.main.JavaCompiler.compile(JavaCompiler.java:946)
              at jdk.compiler/com.sun.tools.javac.api.JavacTaskImpl.lambda$doCall$0(JavacTaskImpl.java:104)
              at jdk.compiler/com.sun.tools.javac.api.JavacTaskImpl.invocationHelper(JavacTaskImpl.java:152)
              at jdk.compiler/com.sun.tools.javac.api.JavacTaskImpl.doCall(JavacTaskImpl.java:100)
              at jdk.compiler/com.sun.tools.javac.api.JavacTaskImpl.call(JavacTaskImpl.java:94)
              at org.gradle.internal.compiler.java.IncrementalCompileTask.call(IncrementalCompileTask.java:89)
              at org.gradle.api.internal.tasks.compile.AnnotationProcessingCompileTask.call(AnnotationProcessingCompileTask.java:94)
              at org.gradle.api.internal.tasks.compile.ResourceCleaningCompilationTask.call(ResourceCleaningCompilationTask.java:57)
              at org.gradle.api.internal.tasks.compile.JdkJavaCompiler.execute(JdkJavaCompiler.java:54)
              at org.gradle.api.internal.tasks.compile.JdkJavaCompiler.execute(JdkJavaCompiler.java:39)
              at org.gradle.api.internal.tasks.compile.daemon.AbstractDaemonCompiler$CompilerWorkAction.execute(AbstractDaemonCompiler.java:135)
              at org.gradle.workers.internal.DefaultWorkerServer.execute(DefaultWorkerServer.java:63)
              at org.gradle.workers.internal.AbstractClassLoaderWorker$1.create(AbstractClassLoaderWorker.java:49)
              at org.gradle.workers.internal.AbstractClassLoaderWorker$1.create(AbstractClassLoaderWorker.java:43)
              at org.gradle.internal.classloader.ClassLoaderUtils.executeInClassloader(ClassLoaderUtils.java:97)
              at org.gradle.workers.internal.AbstractClassLoaderWorker.executeInClassLoader(AbstractClassLoaderWorker.java:43)
              at org.gradle.workers.internal.FlatClassLoaderWorker.run(FlatClassLoaderWorker.java:32)
              at org.gradle.workers.internal.FlatClassLoaderWorker.run(FlatClassLoaderWorker.java:22)
              at org.gradle.workers.internal.WorkerDaemonServer.run(WorkerDaemonServer.java:85)
              at org.gradle.workers.internal.WorkerDaemonServer.run(WorkerDaemonServer.java:55)
              at org.gradle.process.internal.worker.request.WorkerAction$1.call(WorkerAction.java:138)
              at org.gradle.process.internal.worker.child.WorkerLogEventListener.withWorkerLoggingProtocol(WorkerLogEventListener.java:41)
              at org.gradle.process.internal.worker.request.WorkerAction.run(WorkerAction.java:135)
              at java.base/jdk.internal.reflect.NativeMethodAccessorImpl.invoke0(Native Method)
              at java.base/jdk.internal.reflect.NativeMethodAccessorImpl.invoke(NativeMethodAccessorImpl.java:77)
              at java.base/jdk.internal.reflect.DelegatingMethodAccessorImpl.invoke(DelegatingMethodAccessorImpl.java:43)
              at java.base/java.lang.reflect.Method.invoke(Method.java:568)
              at org.gradle.internal.dispatch.ReflectionDispatch.dispatch(ReflectionDispatch.java:36)
              at org.gradle.internal.dispatch.ReflectionDispatch.dispatch(ReflectionDispatch.java:24)
              at org.gradle.internal.remote.internal.hub.MessageHubBackedObjectConnection$DispatchWrapper.dispatch(MessageHubBackedObjectConnection.java:182)
              at org.gradle.internal.remote.internal.hub.MessageHubBackedObjectConnection$DispatchWrapper.dispatch(MessageHubBackedObjectConnection.java:164)
              at org.gradle.internal.remote.internal.hub.MessageHub$Handler.run(MessageHub.java:414)
              at org.gradle.internal.concurrent.ExecutorPolicy$CatchAndRecordFailures.onExecute(ExecutorPolicy.java:64)
              at org.gradle.internal.concurrent.ManagedExecutorImpl$1.run(ManagedExecutorImpl.java:48)
              at java.base/java.util.concurrent.ThreadPoolExecutor.runWorker(ThreadPoolExecutor.java:1136)
              at java.base/java.util.concurrent.ThreadPoolExecutor$Worker.run(ThreadPoolExecutor.java:635)
              at org.gradle.internal.concurrent.ThreadFactoryImpl$ManagedThreadRunnable.run(ThreadFactoryImpl.java:61)
              at java.base/java.lang.Thread.run(Thread.java:833)

      > Task :SoftwareModeling:compileJava FAILED

      FAILURE: Build failed with an exception.

      * What went wrong:
      Execution failed for task ':SoftwareModeling:compileJava'.
      > Compilation failed; see the compiler error output for details.

      * Try:
      Run with --info or --debug option to get more log output. Run with --scan to get full insights.

      * Exception is:
      org.gradle.api.tasks.TaskExecutionException: Execution failed for task ':SoftwareModeling:compileJava'.
              at org.gradle.api.internal.tasks.execution.ExecuteActionsTaskExecuter.lambda$executeIfValid$1(ExecuteActionsTaskExecuter.java:188)
              at org.gradle.internal.Try$Failure.ifSuccessfulOrElse(Try.java:282)
              at org.gradle.api.internal.tasks.execution.ExecuteActionsTaskExecuter.executeIfValid(ExecuteActionsTaskExecuter.java:186)
              at org.gradle.api.internal.tasks.execution.ExecuteActionsTaskExecuter.execute(ExecuteActionsTaskExecuter.java:174)
              at org.gradle.api.internal.tasks.execution.CleanupStaleOutputsExecuter.execute(CleanupStaleOutputsExecuter.java:109)
              at org.gradle.api.internal.tasks.execution.FinalizePropertiesTaskExecuter.execute(FinalizePropertiesTaskExecuter.java:46)
              at org.gradle.api.internal.tasks.execution.ResolveTaskExecutionModeExecuter.execute(ResolveTaskExecutionModeExecuter.java:51)
              at org.gradle.api.internal.tasks.execution.SkipTaskWithNoActionsExecuter.execute(SkipTaskWithNoActionsExecuter.java:57)
              at org.gradle.api.internal.tasks.execution.SkipOnlyIfTaskExecuter.execute(SkipOnlyIfTaskExecuter.java:56)
              at org.gradle.api.internal.tasks.execution.CatchExceptionTaskExecuter.execute(CatchExceptionTaskExecuter.java:36)
              at org.gradle.api.internal.tasks.execution.EventFiringTaskExecuter$1.executeTask(EventFiringTaskExecuter.java:77)
              at org.gradle.api.internal.tasks.execution.EventFiringTaskExecuter$1.call(EventFiringTaskExecuter.java:55)
              at org.gradle.api.internal.tasks.execution.EventFiringTaskExecuter$1.call(EventFiringTaskExecuter.java:52)
              at org.gradle.internal.operations.DefaultBuildOperationRunner$CallableBuildOperationWorker.execute(DefaultBuildOperationRunner.java:200)
              at org.gradle.internal.operations.DefaultBuildOperationRunner$CallableBuildOperationWorker.execute(DefaultBuildOperationRunner.java:195)
              at org.gradle.internal.operations.DefaultBuildOperationRunner$3.execute(DefaultBuildOperationRunner.java:75)
              at org.gradle.internal.operations.DefaultBuildOperationRunner$3.execute(DefaultBuildOperationRunner.java:68)
              at org.gradle.internal.operations.DefaultBuildOperationRunner.execute(DefaultBuildOperationRunner.java:153)
              at org.gradle.internal.operations.DefaultBuildOperationRunner.execute(DefaultBuildOperationRunner.java:68)
              at org.gradle.internal.operations.DefaultBuildOperationRunner.call(DefaultBuildOperationRunner.java:62)
              at org.gradle.internal.operations.DefaultBuildOperationExecutor.lambda$call$2(DefaultBuildOperationExecutor.java:79)
              at org.gradle.internal.operations.UnmanagedBuildOperationWrapper.callWithUnmanagedSupport(UnmanagedBuildOperationWrapper.java:54)
              at org.gradle.internal.operations.DefaultBuildOperationExecutor.call(DefaultBuildOperationExecutor.java:79)
              at org.gradle.api.internal.tasks.execution.EventFiringTaskExecuter.execute(EventFiringTaskExecuter.java:52)
              at org.gradle.execution.plan.LocalTaskNodeExecutor.execute(LocalTaskNodeExecutor.java:74)
              at org.gradle.execution.taskgraph.DefaultTaskExecutionGraph$InvokeNodeExecutorsAction.execute(DefaultTaskExecutionGraph.java:402)
              at org.gradle.execution.taskgraph.DefaultTaskExecutionGraph$InvokeNodeExecutorsAction.execute(DefaultTaskExecutionGraph.java:389)
              at org.gradle.execution.taskgraph.DefaultTaskExecutionGraph$BuildOperationAwareExecutionAction.execute(DefaultTaskExecutionGraph.java:382)
              at org.gradle.execution.taskgraph.DefaultTaskExecutionGraph$BuildOperationAwareExecutionAction.execute(DefaultTaskExecutionGraph.java:368)
              at org.gradle.execution.plan.DefaultPlanExecutor$ExecutorWorker.lambda$run$0(DefaultPlanExecutor.java:127)
              at org.gradle.execution.plan.DefaultPlanExecutor$ExecutorWorker.execute(DefaultPlanExecutor.java:191)
              at org.gradle.execution.plan.DefaultPlanExecutor$ExecutorWorker.executeNextNode(DefaultPlanExecutor.java:182)
              at org.gradle.execution.plan.DefaultPlanExecutor$ExecutorWorker.run(DefaultPlanExecutor.java:124)
              at org.gradle.execution.plan.DefaultPlanExecutor.process(DefaultPlanExecutor.java:72)
              at org.gradle.execution.taskgraph.DefaultTaskExecutionGraph.executeWithServices(DefaultTaskExecutionGraph.java:187)
              at org.gradle.execution.taskgraph.DefaultTaskExecutionGraph.execute(DefaultTaskExecutionGraph.java:180)
              at org.gradle.execution.SelectedTaskExecutionAction.execute(SelectedTaskExecutionAction.java:39)
              at org.gradle.execution.DefaultBuildWorkExecutor.execute(DefaultBuildWorkExecutor.java:44)
              at org.gradle.execution.DefaultBuildWorkExecutor.access$000(DefaultBuildWorkExecutor.java:26)
              at org.gradle.execution.DefaultBuildWorkExecutor$1.proceed(DefaultBuildWorkExecutor.java:52)
              at org.gradle.execution.DryRunBuildExecutionAction.execute(DryRunBuildExecutionAction.java:49)
              at org.gradle.execution.DefaultBuildWorkExecutor.execute(DefaultBuildWorkExecutor.java:44)
              at org.gradle.execution.DefaultBuildWorkExecutor.execute(DefaultBuildWorkExecutor.java:36)
              at org.gradle.execution.UndefinedBuildWorkExecutor.execute(UndefinedBuildWorkExecutor.java:48)
              at org.gradle.execution.BuildOperationFiringBuildWorkerExecutor$ExecuteTasks.call(BuildOperationFiringBuildWorkerExecutor.java:51)
              at org.gradle.execution.BuildOperationFiringBuildWorkerExecutor$ExecuteTasks.call(BuildOperationFiringBuildWorkerExecutor.java:42)
              at org.gradle.internal.operations.DefaultBuildOperationRunner$CallableBuildOperationWorker.execute(DefaultBuildOperationRunner.java:200)
              at org.gradle.internal.operations.DefaultBuildOperationRunner$CallableBuildOperationWorker.execute(DefaultBuildOperationRunner.java:195)
              at org.gradle.internal.operations.DefaultBuildOperationRunner$3.execute(DefaultBuildOperationRunner.java:75)
              at org.gradle.internal.operations.DefaultBuildOperationRunner$3.execute(DefaultBuildOperationRunner.java:68)
              at org.gradle.internal.operations.DefaultBuildOperationRunner.execute(DefaultBuildOperationRunner.java:153)
              at org.gradle.internal.operations.DefaultBuildOperationRunner.execute(DefaultBuildOperationRunner.java:68)
              at org.gradle.internal.operations.DefaultBuildOperationRunner.call(DefaultBuildOperationRunner.java:62)
              at org.gradle.internal.operations.DefaultBuildOperationExecutor.lambda$call$2(DefaultBuildOperationExecutor.java:79)
              at org.gradle.internal.operations.UnmanagedBuildOperationWrapper.callWithUnmanagedSupport(UnmanagedBuildOperationWrapper.java:54)
              at org.gradle.internal.operations.DefaultBuildOperationExecutor.call(DefaultBuildOperationExecutor.java:79)
              at org.gradle.execution.BuildOperationFiringBuildWorkerExecutor.execute(BuildOperationFiringBuildWorkerExecutor.java:39)
              at org.gradle.internal.build.DefaultBuildLifecycleController.lambda$executeTasks$4(DefaultBuildLifecycleController.java:135)
              at org.gradle.internal.build.DefaultBuildLifecycleController.withModel(DefaultBuildLifecycleController.java:157)
              at org.gradle.internal.build.DefaultBuildLifecycleController.executeTasks(DefaultBuildLifecycleController.java:131)
              at org.gradle.internal.buildtree.DefaultBuildTreeWorkExecutor.execute(DefaultBuildTreeWorkExecutor.java:35)
              at org.gradle.internal.buildtree.BuildOperationFiringBuildTreeWorkExecutor$1.call(BuildOperationFiringBuildTreeWorkExecutor.java:40)
              at org.gradle.internal.buildtree.BuildOperationFiringBuildTreeWorkExecutor$1.call(BuildOperationFiringBuildTreeWorkExecutor.java:37)
              at org.gradle.internal.operations.DefaultBuildOperationRunner$CallableBuildOperationWorker.execute(DefaultBuildOperationRunner.java:200)
              at org.gradle.internal.operations.DefaultBuildOperationRunner$CallableBuildOperationWorker.execute(DefaultBuildOperationRunner.java:195)
              at org.gradle.internal.operations.DefaultBuildOperationRunner$3.execute(DefaultBuildOperationRunner.java:75)
              at org.gradle.internal.operations.DefaultBuildOperationRunner$3.execute(DefaultBuildOperationRunner.java:68)
              at org.gradle.internal.operations.DefaultBuildOperationRunner.execute(DefaultBuildOperationRunner.java:153)
              at org.gradle.internal.operations.DefaultBuildOperationRunner.execute(DefaultBuildOperationRunner.java:68)
              at org.gradle.internal.operations.DefaultBuildOperationRunner.call(DefaultBuildOperationRunner.java:62)
              at org.gradle.internal.operations.DefaultBuildOperationExecutor.lambda$call$2(DefaultBuildOperationExecutor.java:79)
              at org.gradle.internal.operations.UnmanagedBuildOperationWrapper.callWithUnmanagedSupport(UnmanagedBuildOperationWrapper.java:54)
              at org.gradle.internal.operations.DefaultBuildOperationExecutor.call(DefaultBuildOperationExecutor.java:79)
              at org.gradle.internal.buildtree.BuildOperationFiringBuildTreeWorkExecutor.execute(BuildOperationFiringBuildTreeWorkExecutor.java:37)
              at org.gradle.internal.buildtree.DefaultBuildTreeLifecycleController.lambda$doScheduleAndRunTasks$1(DefaultBuildTreeLifecycleController.java:84)
              at org.gradle.composite.internal.DefaultIncludedBuildTaskGraph.withNewTaskGraph(DefaultIncludedBuildTaskGraph.java:94)
              at org.gradle.internal.buildtree.DefaultBuildTreeLifecycleController.doScheduleAndRunTasks(DefaultBuildTreeLifecycleController.java:82)
              at org.gradle.internal.buildtree.DefaultBuildTreeLifecycleController.runBuild(DefaultBuildTreeLifecycleController.java:104)
              at org.gradle.internal.buildtree.DefaultBuildTreeLifecycleController.scheduleAndRunTasks(DefaultBuildTreeLifecycleController.java:64)
              at org.gradle.tooling.internal.provider.ExecuteBuildActionRunner.run(ExecuteBuildActionRunner.java:31)
              at org.gradle.launcher.exec.ChainingBuildActionRunner.run(ChainingBuildActionRunner.java:35)
              at org.gradle.internal.buildtree.ProblemReportingBuildActionRunner.run(ProblemReportingBuildActionRunner.java:47)
              at org.gradle.launcher.exec.BuildOutcomeReportingBuildActionRunner.run(BuildOutcomeReportingBuildActionRunner.java:69)
              at org.gradle.tooling.internal.provider.FileSystemWatchingBuildActionRunner.run(FileSystemWatchingBuildActionRunner.java:91)
              at org.gradle.launcher.exec.BuildCompletionNotifyingBuildActionRunner.run(BuildCompletionNotifyingBuildActionRunner.java:41)
              at org.gradle.launcher.exec.RootBuildLifecycleBuildActionExecutor.lambda$execute$0(RootBuildLifecycleBuildActionExecutor.java:40)
              at org.gradle.composite.internal.DefaultRootBuildState.run(DefaultRootBuildState.java:154)
              at org.gradle.launcher.exec.RootBuildLifecycleBuildActionExecutor.execute(RootBuildLifecycleBuildActionExecutor.java:40)
              at org.gradle.internal.buildtree.DefaultBuildTreeContext.execute(DefaultBuildTreeContext.java:40)
              at org.gradle.launcher.exec.BuildTreeLifecycleBuildActionExecutor.lambda$execute$0(BuildTreeLifecycleBuildActionExecutor.java:56)
              at org.gradle.internal.buildtree.BuildTreeState.run(BuildTreeState.java:53)
              at org.gradle.launcher.exec.BuildTreeLifecycleBuildActionExecutor.execute(BuildTreeLifecycleBuildActionExecutor.java:56)
              at org.gradle.launcher.exec.RunAsBuildOperationBuildActionExecutor$3.call(RunAsBuildOperationBuildActionExecutor.java:61)
              at org.gradle.launcher.exec.RunAsBuildOperationBuildActionExecutor$3.call(RunAsBuildOperationBuildActionExecutor.java:57)
              at org.gradle.internal.operations.DefaultBuildOperationRunner$CallableBuildOperationWorker.execute(DefaultBuildOperationRunner.java:200)
              at org.gradle.internal.operations.DefaultBuildOperationRunner$CallableBuildOperationWorker.execute(DefaultBuildOperationRunner.java:195)
              at org.gradle.internal.operations.DefaultBuildOperationRunner$3.execute(DefaultBuildOperationRunner.java:75)
              at org.gradle.internal.operations.DefaultBuildOperationRunner$3.execute(DefaultBuildOperationRunner.java:68)
              at org.gradle.internal.operations.DefaultBuildOperationRunner.execute(DefaultBuildOperationRunner.java:153)
              at org.gradle.internal.operations.DefaultBuildOperationRunner.execute(DefaultBuildOperationRunner.java:68)
              at org.gradle.internal.operations.DefaultBuildOperationRunner.call(DefaultBuildOperationRunner.java:62)
              at org.gradle.internal.operations.DefaultBuildOperationExecutor.lambda$call$2(DefaultBuildOperationExecutor.java:79)
              at org.gradle.internal.operations.UnmanagedBuildOperationWrapper.callWithUnmanagedSupport(UnmanagedBuildOperationWrapper.java:54)
              at org.gradle.internal.operations.DefaultBuildOperationExecutor.call(DefaultBuildOperationExecutor.java:79)
              at org.gradle.launcher.exec.RunAsBuildOperationBuildActionExecutor.execute(RunAsBuildOperationBuildActionExecutor.java:57)
              at org.gradle.launcher.exec.RunAsWorkerThreadBuildActionExecutor.lambda$execute$0(RunAsWorkerThreadBuildActionExecutor.java:38)
              at org.gradle.internal.work.DefaultWorkerLeaseService.withLocks(DefaultWorkerLeaseService.java:211)
              at org.gradle.launcher.exec.RunAsWorkerThreadBuildActionExecutor.execute(RunAsWorkerThreadBuildActionExecutor.java:38)
              at org.gradle.tooling.internal.provider.ContinuousBuildActionExecutor.execute(ContinuousBuildActionExecutor.java:103)
              at org.gradle.tooling.internal.provider.SubscribableBuildActionExecutor.execute(SubscribableBuildActionExecutor.java:64)
              at org.gradle.internal.session.DefaultBuildSessionContext.execute(DefaultBuildSessionContext.java:46)
              at org.gradle.tooling.internal.provider.BuildSessionLifecycleBuildActionExecuter.lambda$execute$0(BuildSessionLifecycleBuildActionExecuter.java:56)
              at org.gradle.internal.session.BuildSessionState.run(BuildSessionState.java:69)
              at org.gradle.tooling.internal.provider.BuildSessionLifecycleBuildActionExecuter.execute(BuildSessionLifecycleBuildActionExecuter.java:55)
              at org.gradle.tooling.internal.provider.BuildSessionLifecycleBuildActionExecuter.execute(BuildSessionLifecycleBuildActionExecuter.java:37)
              at org.gradle.tooling.internal.provider.GradleThreadBuildActionExecuter.execute(GradleThreadBuildActionExecuter.java:36)
              at org.gradle.tooling.internal.provider.GradleThreadBuildActionExecuter.execute(GradleThreadBuildActionExecuter.java:25)
              at org.gradle.tooling.internal.provider.StartParamsValidatingActionExecuter.execute(StartParamsValidatingActionExecuter.java:63)
              at org.gradle.tooling.internal.provider.StartParamsValidatingActionExecuter.execute(StartParamsValidatingActionExecuter.java:31)
              at org.gradle.tooling.internal.provider.SessionFailureReportingActionExecuter.execute(SessionFailureReportingActionExecuter.java:58)
              at org.gradle.tooling.internal.provider.SessionFailureReportingActionExecuter.execute(SessionFailureReportingActionExecuter.java:42)
              at org.gradle.tooling.internal.provider.SetupLoggingActionExecuter.execute(SetupLoggingActionExecuter.java:47)
              at org.gradle.tooling.internal.provider.SetupLoggingActionExecuter.execute(SetupLoggingActionExecuter.java:31)
              at org.gradle.launcher.daemon.server.exec.ExecuteBuild.doBuild(ExecuteBuild.java:65)
              at org.gradle.launcher.daemon.server.exec.BuildCommandOnly.execute(BuildCommandOnly.java:37)
              at org.gradle.launcher.daemon.server.api.DaemonCommandExecution.proceed(DaemonCommandExecution.java:104)
              at org.gradle.launcher.daemon.server.exec.WatchForDisconnection.execute(WatchForDisconnection.java:39)
              at org.gradle.launcher.daemon.server.api.DaemonCommandExecution.proceed(DaemonCommandExecution.java:104)
              at org.gradle.launcher.daemon.server.exec.ResetDeprecationLogger.execute(ResetDeprecationLogger.java:29)
              at org.gradle.launcher.daemon.server.api.DaemonCommandExecution.proceed(DaemonCommandExecution.java:104)
              at org.gradle.launcher.daemon.server.exec.RequestStopIfSingleUsedDaemon.execute(RequestStopIfSingleUsedDaemon.java:35)
              at org.gradle.launcher.daemon.server.api.DaemonCommandExecution.proceed(DaemonCommandExecution.java:104)
              at org.gradle.launcher.daemon.server.exec.ForwardClientInput$2.create(ForwardClientInput.java:78)
              at org.gradle.launcher.daemon.server.exec.ForwardClientInput$2.create(ForwardClientInput.java:75)
              at org.gradle.util.internal.Swapper.swap(Swapper.java:38)
              at org.gradle.launcher.daemon.server.exec.ForwardClientInput.execute(ForwardClientInput.java:75)
              at org.gradle.launcher.daemon.server.api.DaemonCommandExecution.proceed(DaemonCommandExecution.java:104)
              at org.gradle.launcher.daemon.server.exec.LogAndCheckHealth.execute(LogAndCheckHealth.java:55)
              at org.gradle.launcher.daemon.server.api.DaemonCommandExecution.proceed(DaemonCommandExecution.java:104)
              at org.gradle.launcher.daemon.server.exec.LogToClient.doBuild(LogToClient.java:63)
              at org.gradle.launcher.daemon.server.exec.BuildCommandOnly.execute(BuildCommandOnly.java:37)
              at org.gradle.launcher.daemon.server.api.DaemonCommandExecution.proceed(DaemonCommandExecution.java:104)
              at org.gradle.launcher.daemon.server.exec.EstablishBuildEnvironment.doBuild(EstablishBuildEnvironment.java:84)
              at org.gradle.launcher.daemon.server.exec.BuildCommandOnly.execute(BuildCommandOnly.java:37)
              at org.gradle.launcher.daemon.server.api.DaemonCommandExecution.proceed(DaemonCommandExecution.java:104)
              at org.gradle.launcher.daemon.server.exec.StartBuildOrRespondWithBusy$1.run(StartBuildOrRespondWithBusy.java:52)
              at org.gradle.launcher.daemon.server.DaemonStateCoordinator$1.run(DaemonStateCoordinator.java:297)
              at org.gradle.internal.concurrent.ExecutorPolicy$CatchAndRecordFailures.onExecute(ExecutorPolicy.java:64)
              at org.gradle.internal.concurrent.ManagedExecutorImpl$1.run(ManagedExecutorImpl.java:48)
              at org.gradle.internal.concurrent.ThreadFactoryImpl$ManagedThreadRunnable.run(ThreadFactoryImpl.java:61)
      Caused by: org.gradle.api.internal.tasks.compile.CompilationFailedException: Compilation failed; see the compiler error output for details.
              at org.gradle.api.internal.tasks.compile.JdkJavaCompiler.execute(JdkJavaCompiler.java:56)
              at org.gradle.api.internal.tasks.compile.JdkJavaCompiler.execute(JdkJavaCompiler.java:39)
              at org.gradle.api.internal.tasks.compile.daemon.AbstractDaemonCompiler$CompilerWorkAction.execute(AbstractDaemonCompiler.java:135)
              at org.gradle.workers.internal.DefaultWorkerServer.execute(DefaultWorkerServer.java:63)
              at org.gradle.workers.internal.AbstractClassLoaderWorker$1.create(AbstractClassLoaderWorker.java:49)
              at org.gradle.workers.internal.AbstractClassLoaderWorker$1.create(AbstractClassLoaderWorker.java:43)
              at org.gradle.internal.classloader.ClassLoaderUtils.executeInClassloader(ClassLoaderUtils.java:97)
              at org.gradle.workers.internal.AbstractClassLoaderWorker.executeInClassLoader(AbstractClassLoaderWorker.java:43)
              at org.gradle.workers.internal.FlatClassLoaderWorker.run(FlatClassLoaderWorker.java:32)
              at org.gradle.workers.internal.FlatClassLoaderWorker.run(FlatClassLoaderWorker.java:22)
              at org.gradle.workers.internal.WorkerDaemonServer.run(WorkerDaemonServer.java:85)
              at org.gradle.workers.internal.WorkerDaemonServer.run(WorkerDaemonServer.java:55)
              at org.gradle.process.internal.worker.request.WorkerAction$1.call(WorkerAction.java:138)
              at org.gradle.process.internal.worker.child.WorkerLogEventListener.withWorkerLoggingProtocol(WorkerLogEventListener.java:41)
              at org.gradle.process.internal.worker.request.WorkerAction.run(WorkerAction.java:135)
              at java.base/jdk.internal.reflect.NativeMethodAccessorImpl.invoke0(Native Method)
              at java.base/jdk.internal.reflect.NativeMethodAccessorImpl.invoke(NativeMethodAccessorImpl.java:77)
              at java.base/jdk.internal.reflect.DelegatingMethodAccessorImpl.invoke(DelegatingMethodAccessorImpl.java:43)
              at org.gradle.internal.dispatch.ReflectionDispatch.dispatch(ReflectionDispatch.java:36)
              at org.gradle.internal.dispatch.ReflectionDispatch.dispatch(ReflectionDispatch.java:24)
              at org.gradle.internal.remote.internal.hub.MessageHubBackedObjectConnection$DispatchWrapper.dispatch(MessageHubBackedObjectConnection.java:182)
              at org.gradle.internal.remote.internal.hub.MessageHubBackedObjectConnection$DispatchWrapper.dispatch(MessageHubBackedObjectConnection.java:164)
              at org.gradle.internal.remote.internal.hub.MessageHub$Handler.run(MessageHub.java:414)
              at org.gradle.internal.concurrent.ExecutorPolicy$CatchAndRecordFailures.onExecute(ExecutorPolicy.java:64)
              at org.gradle.internal.concurrent.ManagedExecutorImpl$1.run(ManagedExecutorImpl.java:48)
              at org.gradle.internal.concurrent.ThreadFactoryImpl$ManagedThreadRunnable.run(ThreadFactoryImpl.java:61)


      * Get more help at https://help.gradle.org

      BUILD FAILED in 6s
      ```

      REGRESSION : Last worked in version 11.0.13

      STEPS TO FOLLOW TO REPRODUCE THE PROBLEM :
      1. git clone https://github.com/NationalSecurityAgency/ghidra/
      2. git checkout 91c07fd933c2435870a267aea16a50d257b77639
      3. gradle buildGhidra --warning-mode all --stacktrace

      EXPECTED VERSUS ACTUAL BEHAVIOR :
      EXPECTED -
      No exception, successfull build

      ---------- BEGIN SOURCE ----------
      https://github.com/NationalSecurityAgency/ghidra/commit/91c07fd933c2435870a267aea16a50d257b77639
      ---------- END SOURCE ----------

      FREQUENCY : always


        Attachments

          Issue Links

            Activity

              People

              Assignee:
              adev ANUPAM DEV
              Reporter:
              webbuggrp Webbug Group
              Votes:
              0 Vote for this issue
              Watchers:
              2 Start watching this issue

                Dates

                Created:
                Updated:
                Resolved: