Details

      Description

      -------------------------------------------------------------------------------
      Test set: org.openjdk.jmc.flightrecorder.uitest.JfrThreadsPageTest
      -------------------------------------------------------------------------------
      Tests run: 10, Failures: 0, Errors: 3, Skipped: 0, Time elapsed: 118.303 s <<< FAILURE! - in org.openjdk.jmc.flightrecorder.uitest.JfrThreadsPageTest
      testHideAllThreads(org.openjdk.jmc.flightrecorder.uitest.JfrThreadsPageTest) Time elapsed: 20.184 s
      testTextCanvasSelection(org.openjdk.jmc.flightrecorder.uitest.JfrThreadsPageTest) Time elapsed: 6.602 s
      testZoom(org.openjdk.jmc.flightrecorder.uitest.JfrThreadsPageTest) Time elapsed: 16.71 s <<< ERROR!
      org.jemmy.TimeoutExpiredException: State 'Waiting for 1 org.eclipse.swt.widgets.Text controls to be found adhering to Text = 08:06:19:489' has not been reached in 10000 milliseconds
      at org.openjdk.jmc.flightrecorder.uitest.JfrThreadsPageTest.testZoom(JfrThreadsPageTest.java:133)

      testFoldingChart(org.openjdk.jmc.flightrecorder.uitest.JfrThreadsPageTest) Time elapsed: 6.409 s
      testFoldingTable(org.openjdk.jmc.flightrecorder.uitest.JfrThreadsPageTest) Time elapsed: 6.444 s
      testMenuItemEnablement(org.openjdk.jmc.flightrecorder.uitest.JfrThreadsPageTest) Time elapsed: 10.334 s
      testInvalidFoldingActions(org.openjdk.jmc.flightrecorder.uitest.JfrThreadsPageTest) Time elapsed: 7.011 s
      testResetButtons(org.openjdk.jmc.flightrecorder.uitest.JfrThreadsPageTest) Time elapsed: 16.541 s <<< ERROR!
      org.jemmy.TimeoutExpiredException: State 'Waiting for 1 org.eclipse.swt.widgets.Text controls to be found adhering to Text = 08:06:19:489' has not been reached in 10000 milliseconds
      at org.openjdk.jmc.flightrecorder.uitest.JfrThreadsPageTest.testResetButtons(JfrThreadsPageTest.java:158)

      testTimeFilterInvalid(org.openjdk.jmc.flightrecorder.uitest.JfrThreadsPageTest) Time elapsed: 16.63 s <<< ERROR!
      org.jemmy.TimeoutExpiredException: State 'Waiting for 1 org.eclipse.swt.widgets.Text controls to be found adhering to Text = 08:06:19:489' has not been reached in 10000 milliseconds
      at org.openjdk.jmc.flightrecorder.uitest.JfrThreadsPageTest.testTimeFilterInvalid(JfrThreadsPageTest.java:177)

      testPersistingSashWeights(org.openjdk.jmc.flightrecorder.uitest.JfrThreadsPageTest) Time elapsed: 11.158 s

        Attachments

          Issue Links

            Activity

              People

              • Assignee:
                aptmac Alex Macdonald
                Reporter:
                hirt Marcus Hirt
              • Votes:
                0 Vote for this issue
                Watchers:
                3 Start watching this issue

                Dates

                • Created:
                  Updated:
                  Resolved: