Version 9

UNRELEASED

Start date not set

Release date not set

Release Notes

1200 of 19303View in Issue Navigator
PTKeySummaryAssigneeStatus
P1BugJDK-6675699need comprehensive fix for unconstrained ConvI2L with narrowed typeTobias HartmannResolved
P1BugJDK-7076820assert(addr != 0) failed: address sanity check in PerfMemory::detach with -XX:-UsePerfDataDmitry SamersoffResolved
P1BackportJDK-8030189Regression - Unsatisfied Link Error when the Java Access Bridge is startedPete BrunetResolved
P1BugJDK-8030214fix for JDK-8020216 breaks the buildVicente Arturo Romero ZaldivarClosed
P1BugJDK-8030687Add .out files to fix failing testsEric MccorkleClosed
P1BackportJDK-8030713Certificate validation - java.lang.ClassCastExceptionVincent RyanClosed
P1BackportJDK-8030715Document listeners fired outside document lockSergey MalenkovResolved
P1BackportJDK-8030791Enable client-side TLS 1.2 by defaultXue-Lei FanClosed
P1BackportJDK-8030995Signed applet fails to load when CRLs are stored in an LDAP directorySean MullanClosed
P1BugJDK-8031133AbstractMap should specify its default implementation using @implSpecChris HegartyClosed
P1BackportJDK-8031150Several api.java.util.stream tests got "NaN" value instead of "Infinity" or "-Infinity"Joe DarcyClosed
P1BugJDK-8031187DoubleStream.count is incorrect for a stream containing > Integer.MAX_VALUE elementsPaul SandozClosed
P1BackportJDK-8031241nsk/jvmti/RedefineClasses/StressRedefine failed invalid method ordering length on SolarisColeen PhillimoreClosed
P1BackportJDK-8031329java.time.Duration has wrong Javadoc Comments in toDays() and toHours()Roger RiggsClosed
P1BackportJDK-8031400System.setProperties(null) drops all system properties (RELEASE not set)Erik JoelssonResolved
P1BackportJDK-8031488serialVersionUID of javax.xml.bind.TypeConstraintException accidently changedIaroslav SavytskyiClosed
P1BugJDK-8031502JSR292: IncompatibleClassChangeError in LambdaForm for CharSequence.toString() method handle type converterVladimir IvanovClosed
P1BackportJDK-8031616invokestatic: ICCE trying to invoke static method when it clashes with an abstract method inherited from an interfaceHarold SeigelClosed
P1BackportJDK-8031692dtrace/hotspot_jni/ALL/ALL001 crashes the vm on Solaris-amd64, SIGSEGV in MarkSweep::follow_stack()+0x8aRoland WestrelinResolved
P1BugJDK-8031708Windows x86 build failure: JNU_ThrowOutOfMemoryError undefinedChris HegartyClosed
P1BugJDK-8031719ConcurrentAssociateTest, FJExceptionTableLeak, and ToArrayOpTest timeoutAlbert NollClosed
P1EnhancementJDK-8032056Create demo to illustrate new practices of the default methods usageTaras LedkovResolved
P1BugJDK-8032190Specifications of stream flatMap methods should require mapped streams to be closedPaul SandozClosed
P1BugJDK-8032207C2: assert(VerifyOops || MachNode::size(ra_) <= (3+1)*4) failed: bad fixed sizeIgor VeresovResolved
P1BackportJDK-8032262[ Deploy Peer of JDK-8030813 ] Signed applet fails to load when CRLs are stored in an LDAP directoryAndy HerrickClosed
P1BackportJDK-8032391OCSP client can't find responder cert if it uses a different subject key id algorithm than responderIDSean MullanClosed
P1BackportJDK-8032447C2: loadI2L_immI broken for negative memory valuesIgor VeresovResolved
P1BackportJDK-8032575CHA ignores default methods during analysis leading to incorrect code generationVladimir IvanovResolved
P1BackportJDK-8032641javax.swing.plaf.metal.MetalFileChooserUI$FilterComboBoxModel extends non-standard APIAlexander ScherbatiyResolved
P1BackportJDK-8032748jarsigner -verify exits with 0 when a jar file is not properly signedWeijun WangClosed
P1BugJDK-8033115Bad merge between 8027584 and 8031759Magnus Ihse BursieResolved
P1BackportJDK-8033475Applet fails to load images and audio clips.Daniil TitovClosed
P1BackportJDK-8033477Entrust tests(signed/trusted) are failing to connect back to server using jdk8-b123Daniil TitovClosed
P1BackportJDK-8033478REGRESSION:Java Bean test fail in the latest JDK 8 b123Daniil TitovClosed
P1BugJDK-8033680Profiles build brokenUnassignedResolved
P1BugJDK-8033931Several nightly tests failing with assert(imin < imax) failed: Unexpected page sizeGerald ThornbrughClosed
P1BackportJDK-8034001java.util.Comparator::thenComparing has unnecessary type restrictionHenry JenClosed
P1BackportJDK-8034086Wrong version for the first jdk8 fcs build Erik JoelssonResolved
P1BugJDK-8034264No RE build found for jdk9-dev solaris-sparc 2014-02-11 after waiting 5 hoursJerry ZhouClosed
P1BugJDK-8034860Fatal error due to incorrect thread state during nightly testingCalvin CheungClosed
P1BugJDK-8035163[TESTBUG] java/util/stream/test/ tests fail by timeoutStefan SarneClosed
P1BugJDK-8035725Must keep microsoft VS_PATH on PATH after toolchain detectionMagnus Ihse BursieResolved
P1BackportJDK-8035869ShouldNotReachHere() in ConstantPool::copy_entry_toStaffan LarsenResolved
P1BugJDK-8035897Better memory allocation for file descriptors greater than 1024 on macosxChris HegartyClosed
P1BugJDK-8036568Serial incompatibility in java.util.TreeMap.NavigableSubMapJoe DarcyClosed
P1BackportJDK-8036587Default method returns true for a while, and then returns falseVladimir IvanovResolved
P1BugJDK-8036948Solaris builds broken by fix for 8036611: Cleanup of handling of properties ...Erik JoelssonResolved
P1BugJDK-8036966"hg tclone" does not work like "hg fclone"David KatlemanResolved
P1BugJDK-8037345com/sun/jdi/* tests can fail, with race condition on log filesStaffan LarsenResolved
P1BugJDK-8037377Windows: compilation failed after the fix for 8033712Oleg PekhovskiyResolved
P1EnhancementJDK-8037548--with-rtpatch-dir needs to be removed from client build scriptsAmy WangClosed
P1BackportJDK-8037569Crash in JIT when running Scala compiler (and compiling Scala std lib)Vladimir KozlovResolved
P1TaskJDK-8037816Fix for 8036122 breaks build with Xcode5/clangDavid ChaseResolved
P1BugJDK-8037842Failing to allocate MethodCounters and MDO causes a serious performance dropColeen PhillimoreClosed
P1BugJDK-8037868The build is broken after the JDK-8035630Sergey BylokhovResolved
P1BugJDK-8038621[nightly] Plugin doesn't work for javafx applets since from build 25.03.2014Thomas NgClosed
P1BugJDK-8038633crash in VM_Version::get_processor_features() on startupVladimir KozlovResolved
P1BugJDK-8039118Windows build failure (j2pcsc.dll : fatal error unresolved external symbol throwByName)Chris HegartyClosed
P1BugJDK-80392439-dev windows-amd64 fails with Error: $(CoreDiff.BASEIMAGE)=[/core64.zip] file not found - install/make/smartmake/Rules.gmk:12: recipe for target `/core64.zip' failedJerry ZhouClosed
P1BugJDK-8039298C2: assert(base == NULL || t_adr->isa_rawptr() || !phase->type(base)->higher_equal(TypePtr::NULL_PTR)) failed: NULL+offs not RAW address?Vladimir KozlovResolved
P1BugJDK-8039313Correct the fix for JDK-8039155 Daniil TitovResolved
P1BugJDK-8039562Tomcat 7 crashes when using JDK 8UnassignedClosed
P1BugJDK-8040085dtrace/jsdt tests crash on solaris. found an unadvertised bad scavengable oop in the code cacheAlbert NollResolved
P1BugJDK-8040245G1: VM hangs during shutdownPer LidenResolved
P1BugJDK-8040332fixpath must quote empty string argumentsMichael DuigouResolved
P1BugJDK-8040932Promotion builds for different platform launchs NC testingAmy WangResolved
P1BackportJDK-8041110SIGSEGV in MethodData::next_data(ProfileData*)Roland WestrelinResolved
P1BugJDK-8041265jdk/bin/rmic -iiop failed on macosx-x86_64 with "Class sun.rmi.rmic.iiop.BatchEnvironmen not found"Erik JoelssonClosed
P1BugJDK-8041521JDK-8034245 breaks a bootcycle buildJonathan GibbonsClosed
P1BugJDK-8041948Build broken by fix of 8033104Staffan LarsenResolved
P1BugJDK-8041955SEGV in G1 MarkStrongCodeRootOopClosure::do_oop()UnassignedResolved
P1BugJDK-8042095Broken bootcycle buildJaroslav BachoríkResolved
P1BugJDK-8042235redefining method used by multiple MethodHandles crashes VMColeen PhillimoreResolved
P1BackportJDK-8042552Regression- Java Control Panel Advanced tab failed to display Daniil TitovResolved
P1BugJDK-8042570Excessive number of tests timing out on nightly testing due to fix for 8040798Albert NollResolved
P1BugJDK-8042658Fix crash of unit tests for none windows platformsVictor DrozdovResolved
P1BugJDK-8042715bigapps/runThese/stability fails on nightly with SIGSEGVTobias HartmannResolved
P1BugJDK-8042859Build broken for SolarisEric MccorkleResolved
P1JEPJDK-8042950JEP 110: HTTP/2 Client (Incubator)Michael McMahonCompleted
P1BugJDK-8042969Fix JUnit tests hangDaniil TitovClosed
P1BugJDK-8043030Fix JUnit compilation errorDaniil TitovResolved
P1BugJDK-8043262Mac OS X : Manage Certificates/ Restore Security Prompts options missing from Java Control Panel David DehavenResolved
P1BugJDK-8043537Changes for JDK-8039951 introduced circular dependency between Kerberos and com.sun.security.authWeijun WangClosed
P1BugJDK-8043716JDI test com/sun/jdi/ProcessAttachTest.sh and other 3 jdi tests failed in nightlyDmitry SamersoffClosed
P1JEPJDK-8043758JEP 219: Datagram Transport Layer Security (DTLS)Xue-Lei FanCompleted
P1BugJDK-8044035RPM internal names must match the standard bundle file name patternsPranav BhatClosed
P1TaskJDK-8044202Remove deprecated GC combinationsUnassignedResolved
P1BugJDK-8046239Build failure in 9-client on all non-Windows platformsAlexey IvanovResolved
P1BugJDK-8046245JDK 9 client build failure on SolarisSergey BylokhovResolved
P1BugJDK-8046275Fastdebug build failing on jdk9/hs/ control jobs after pulling some hs-comp changesVladimir KozlovResolved
P1BackportJDK-8046497API for debugging NashornSundararajan AthijegannathanClosed
P1BugJDK-8046684sharedRuntime.cpp...assert(((nmethod*)cb)->is_at_poll_or_poll_return(pc)) failed: safepoint polling: type must be pollIgor VeresovResolved
P1BugJDK-8046809vm/mlvm/meth/stress/compiler/deoptimize CodeCache is full.Albert NollResolved
P1BackportJDK-8046822Browser throws ClassNotFoundException when javaws.args present in deployment.properties on WindowsDaniil TitovResolved
P1BugJDK-8047734gcc/g++ -Og is harmful to the debugging experience.Michael DuigouResolved
P1BugJDK-8048859jdk9-dev build job for win-amd64 fail on 2014-07-01Jerry ZhouClosed
P1BackportJDK-8048899out-of-date dialogs are not displayed correctly in svAlex MenkovClosed
P1BugJDK-8049010jdk9-dev build job for mac x86-64 failed on 2014-07-01Jerry ZhouClosed
P1BugJDK-8049411Minimal VM build broken after gcId.cpp was addedStefan KarlssonResolved
P1BugJDK-8050118Windows policy file missing semicolonVincent RyanClosed
P1BugJDK-8050485super() in a try block in a ctor may need to cause VerifyErrorHarold SeigelClosed
P1BugJDK-8051399Fix for JDK-8043071 breaks dev buildWeijun WangClosed
P1JEPJDK-8051498JEP 244: TLS Application-Layer Protocol Negotiation ExtensionBradford WetmoreCompleted
P1BugJDK-8051588[headless] DataTransferer.getInstance throws ClassCastException in headless modePetr PchelkoResolved
P1JEPJDK-8051618JEP 200: The Modular JDKMark ReinholdIntegrated
P1JEPJDK-8051619JEP 201: Modular Source CodeAlan BatemanCompleted
P1BugJDK-8053902Fix for 8030115 breaks build on Windows and SolarisDmitry SamersoffResolved
P1BugJDK-80540548040121 is brokenRoland WestrelinResolved
P1Sub-taskJDK-8054834Modular Source CodeChris HegartyResolved
P1BugJDK-8054883Segmentation error while running programIgor VeresovResolved
P1BugJDK-8055530assert(_exits.control()->is_top() || !_gvn.type(ret_phi)->empty()) failed: return value must be well definedRoland WestrelinResolved
P1BugJDK-8057910G1: BOT verification should not pass topBengt RutissonResolved
P1BugJDK-8057990please help reboot scaaa268 host on 9/10Jerry ZhouClosed
P1BugJDK-8058461serviceability/dcmd/CodelistTest.java and serviceability/dcmd/CompilerQueueTest.java SIGSEGVNils EliassonResolved
P1BugJDK-8058504[TESTBUG] Temporarily disable failing test runtime/NMT/MallocTrackingVerify.java George TriantafillouClosed
P1BugJDK-8058536java/lang/instrument/NativeMethodPrefixAgent.java fails due to VirtualMachineError: out of space in CodeCache for method handle intrinsicIgor VeresovResolved
P1BugJDK-8058564Tiered compilation performance drop in PITIgor VeresovResolved
P1BugJDK-8058708java.lang.AssertionError compiling source codeVicente Arturo Romero ZaldivarClosed
P1BugJDK-8058892FILL_ARRAYS and ARRAYS are eagely initialized in MethodHandleImplVladimir IvanovResolved
P1BugJDK-8059037JdpTest.sh hangs when trying to kill the test VMDmitry SamersoffResolved
P1BugJDK-8059132Nashorn broke JDK9 build, because JDK make of Nasgen has bootstrapping problemsMarcus LagergrenClosed
P1BugJDK-8059215metaspace/shrink_grow/ShrinkGrowMultiJVM times outUnassignedClosed
P1JEP TaskJDK-8059245Propose or Postpone for Server Management with AMC (AMC 3.0)Joe McglynnOpen
P1JEP TaskJDK-8059246Resourced or Red for Server Management with AMC (AMC 3.0)Joe McglynnOpen
P1BugJDK-8059553Libraries not found on machines running bigapps testsUnassignedClosed
P1JEPJDK-8059557JEP 245: Validate JVM Command-Line Flag ArgumentsGerard ZiemskiClosed
P1BugJDK-8059651Tests specify -XX:+UseG1GC and -XX:ParallelGCThreads=0Marcus LarssonResolved
P1BugJDK-8059653VM startup fails with 'Invalid code heap sizes' if -XX:ReservedCodeCacheSize is setTobias HartmannResolved
P1BugJDK-8059837G1 may not tenure objects after MaxTenuringThreshold young GCsStefan JohanssonResolved
P1BugJDK-8059924com/sun/management/DiagnosticCommandMBean/DcmdMBeanPermissionsTest.java: assert(Universe::verify_in_progress() || !SafepointSynchronize::is_at_safepoint()) failed: invariantAleksey ShipilevClosed
P1BugJDK-8060252JDK-7173584 compiler changes regress SPECjvm2008 on SPARCRoland WestrelinResolved
P1BugJDK-8060454[TESTBUG] Whitebox tests fail with -XX:CompileThreshold=100Tobias HartmannResolved
P1BugJDK-8060479[TESTBUG] compiler/codecache/CheckSegmentedCodeCache.java test fails with product buildTobias HartmannResolved
P1BugJDK-8061432[TESTBUG] runtime/threads/ThreadsCreator times outYumin QiClosed
P1BugJDK-8061467Bad page size passed to setup_large_pages() on SolarisThomas SchatzlResolved
P1BugJDK-8061486[TESTBUG] compiler/whitebox/ tests fail : must be osr_compiled (reappeared in nightlies)Tobias HartmannResolved
P1JEPJDK-8061493JEP 223: New Version-String SchemeIris ClarkCompleted
P1Sub-taskJDK-8061784Quarantine nsk/jvmti/popframe005Nils EliassonResolved
P1Sub-taskJDK-8061947Quarantine serviceability/dcmd/CompilerQueueTest.javaNils EliassonClosed
P1JEPJDK-8061971JEP 220: Modular Run-Time ImagesAlan BatemanIntegrated
P1JEPJDK-8061972JEP 261: Module SystemMark ReinholdIntegrated
P1BugJDK-8061983[TESTBUG] compiler/whitebox/MakeMethodNotCompilableTest.java fails with "must not be in queue"Tobias HartmannResolved
P1BugJDK-80619922x nsk/jdwp/ThreadReference/ForceEarlyReturn/forceEarlyReturn002 fails with "Exception nsk.share.Failure: No threadID found for thread name: forceEarlyReturn002aTestThreadInNative"Mattias TobiassonResolved
P1BugJDK-80619933x nsk/jdi/ThreadReference/forceEarlyReturn/forceEarlyReturn004 fails with "java.lang.NullPointerException"Mattias TobiassonResolved
P1BugJDK-8062063Usage of UseHugeTLBFS, UseLargePagesInMetaspace and huge SurvivorAlignmentInBytes cause crashes in CMBitMapClosure::do_bitStefan JohanssonResolved
P1BugJDK-8062250[TESTBUG] compiler/codecache/CheckSegmentedCodeCache.java fails after CodeCacheMinimumFreeSpace removalTobias HartmannResolved
P1BugJDK-8062320sun/tools/jstatd/TestJstatdUsage.java failed due to java.io.IOException: Stream ClosedJaroslav BachoríkResolved
P1BugJDK-8062450Timeout in LowMemoryTest.javaJaroslav BachoríkResolved
P1BugJDK-8062464sun/tools/jcmd/TestJcmdDefaults failed due to "java.io.IOException: Stream closed"Jaroslav BachoríkResolved
P1JEPJDK-8062493JEP 243: Java-Level JVM Compiler InterfaceDavid TherkelsenCompleted
P1BugJDK-8062578java/util/Timer/NameConstructors.java fails with java.lang.RuntimeException: falseStuart MarksClosed
P1BugJDK-8062735CodeCacheSweeperThread missing from SAAlbert NollResolved
P1BugJDK-8062742compiler/EliminateAutoBox/UnsignedLoads.java fails with client vmTatiana PivovarovaResolved
P1Sub-taskJDK-8063068Dev schedule: Dev implementationXue-Lei FanResolved
P1Sub-taskJDK-8063069Dev schedule: Post Integration StabilizationXue-Lei FanResolved
P1Sub-taskJDK-8063071Dev schedule: Spec designXue-Lei FanResolved
P1BugJDK-8063137Never taken branches should be pruned when GWT LambdaForms are sharedVladimir IvanovResolved
P1BugJDK-8064522Random tests are killed and exits with code 137UnassignedClosed
P1BugJDK-8064523TestMemoryPressureReactionDecommit.java fails with Out Of MemoryDmitry FazunenkoResolved
P1BugJDK-8064571java/lang/instrument/IsModifiableClassAgent.java: assert(length > 0) failed: should only be called if table is presentEric MccorkleResolved
P1BugJDK-8064669compiler/whitebox/AllocationCodeBlobTest.java crashes / assertsIgor IgnatyevResolved
P1BugJDK-8064705LengthNotWritableFilter breaks the buildMarcus LagergrenResolved
P1BugJDK-8064716TestHumongousShrinkHeap.java can not be run with -XX:+ExplicitGCInvokesConcurrentAndrey ZakharovResolved
P1BugJDK-8064909FragmentMetaspace.java got OutOfMemoryErrorMichail ChernovResolved
P1BugJDK-8065346WB_AddToBootstrapClassLoaderSearch calls JvmtiEnv::create_a_jvmti when not in _thread_in_vm stateIoi LamResolved
P1BugJDK-8065634Crash in InstanceKlass::clean_method_data when _method is NULLStefan KarlssonResolved
P1BugJDK-8065740compiler/codecache/OverflowCodeCacheTest.java fails with SIGSEGVTobias HartmannClosed
P1BugJDK-8065865gc/TestSoftReferencesBehaviorOnOOME.java: Error. Can't find source file: TestSoftReference.javaEvgeniya StepanovaResolved
P1BugJDK-8066122CollectionUsageThreshold.java times out when run with -XX:+ExplicitGCInvokesConcurrentMichail ChernovResolved
P1BugJDK-8066141compiler/whitebox/GetNMethodTest.java: java.lang.RuntimeException: blob_type[MethodProfiled] for 2 level isn't MethodNonProfiledTatiana PivovarovaResolved
P1BugJDK-8066143[TESTBUG] New tests in gc/survivorAlignment/ failsFilipp ZhinkinResolved
P1BugJDK-8066448SmallCodeCacheStartup.java exits with exit code 1Tobias HartmannResolved
P1BugJDK-8066708JMXStartStopTest fails to connect to port 38112Jaroslav BachoríkResolved
P1Sub-taskJDK-8066713ignore compiler/types/correctnessIgor IgnatyevResolved
P1BugJDK-8066900Array Out Of Bounds Exception causes variable corruptionIgor VeresovResolved
P1BugJDK-8067154Kitchensink fails with assert(ILocked()) failed: invariantYumin QiResolved
P1BugJDK-8067241DeadlockTest.java failed with negative timeout valueShanliang JiangResolved
P1BugJDK-8067338compiler/debug/TraceIterativeGVN.java segfaultsVladimir IvanovResolved
P1BugJDK-8067368TestConcMarkCycleWB.java crashed at G1CollectedHeap::heap()+0xbStefan JohanssonResolved
P1Sub-taskJDK-8067416[BACKOUT] Move Whitebox test library to top level repositoryAlbert NollClosed
P1Sub-taskJDK-8067475Exclude vm/mlvm/indy/stress/java/mutableCallSiteDekker from executionPavel PunegovResolved
P1BugJDK-8067646[TESTBUG] PrintSharedArchiveAndExit.java fails: -Djava.ext.dirs is not supported. Use -classpath instead.UnassignedClosed
P1BugJDK-8067647[TESTBUG] compiler/rangechecks/TestRangeCheckSmearing.java uses wrong path to Whitebox APIRoland WestrelinResolved
P1BugJDK-8067653LongCrash.java is killed with -9Albert NollClosed
P1BugJDK-8067751OOMEInReferenceHandler.java fails: Cleaner terminated abnormallyMichail ChernovResolved
P1BugJDK-8067769Whitebox API misses deoptimizeFrames() functionsIgor IgnatyevClosed
P1BugJDK-8067773TestSurvivorAlignmentInBytesOption.java: compilation failedEvgeniya StepanovaResolved
P1BugJDK-8067823CheckCompileThresholdScaling.java throws RuntimeExceptionGoetz LindenmaierResolved
P1BugJDK-8067873gc/TestSmallHeap.java does not compileBengt RutissonResolved
P1BugJDK-8067972Bring changes made to WhiteBox.java in 8047290 to that file new location in the top repoVladimir KozlovResolved
P1BugJDK-8067982some jcmd /gc/heap_dump tests failed: hprof output contains warning or errorJiangli ZhouResolved
P1BugJDK-8067983OOMProductionTrace_Arrays fails with the wrong OOMEEvgeniya StepanovaResolved
P1BugJDK-8068003compiler/whitebox/DeoptimizeFramesTest.java fails: compilation 48 can't be availablePavel ChistyakovResolved
P1BugJDK-8068036assert(is_available(index)) failed in G1 csetThomas SchatzlResolved
P1BugJDK-8068435Test7009231.java is killed with -9Albert NollClosed
P1BugJDK-8068439ClearMethodStateTest.java fails: private SimpleTestCase$Helper(int) must be compiledPavel ChistyakovClosed
P1BugJDK-8068440Test6857159.java times outAlbert NollResolved
P1BugJDK-8068441compiler/runtime/6826736/Test.java times outAlbert NollClosed
P1BugJDK-8068448AssertSafepointCheckConsistency4.java fails: assert(_start_array->covered_region().contains(lab)) failed: SanityEric CaspoleResolved
P1BugJDK-8068451Kitchensink fails with assert(_size >= sz) failed: Negative sizeColeen PhillimoreResolved
1200 of 19303