Uploaded image for project: 'JDK'
  1. JDK
  2. JDK-8252952

Lanai : 2 java/awt/image/VolatileImage tests fail - GradientPaints and BitmaskVolatileImage

    Details

    • Subcomponent:
      2d
    • OS:
      os_x

      Description

      The Following tests Fails with the EA5 candidate(8-September) build

      java/awt/image/VolatileImage/GradientPaints.java
      metalEnabled=1
      Metal support is present
      type=LINEAR cycleMethod=NO_CYCLE colorSpace=SRGB xformType=IDENTITY numStops=2 aa=Nonantialiased rendering mode
      java.lang.RuntimeException: Test failed: Number of mismatches (112108) exceeds limit (54000) with tolerance=5
      at GradientPaints.compareImages(GradientPaints.java:284)
      at GradientPaints.testAll(GradientPaints.java:148)
      at GradientPaints.main(GradientPaints.java:351)
      at java.base/jdk.internal.reflect.NativeMethodAccessorImpl.invoke0(Native Method)
      at java.base/jdk.internal.reflect.NativeMethodAccessorImpl.invoke(NativeMethodAccessorImpl.java:64)
      at java.base/jdk.internal.reflect.DelegatingMethodAccessorImpl.invoke(DelegatingMethodAccessorImpl.java:43)
      at java.base/java.lang.reflect.Method.invoke(Method.java:564)
      at com.sun.javatest.regtest.agent.MainWrapper$MainThread.run(MainWrapper.java:127)
      at java.base/java.lang.Thread.run(Thread.java:832)

      JavaTest Message: Test threw exception: java.lang.RuntimeException: Test failed: Number of mismatches (112108) exceeds limit (54000) with tolerance=5
      JavaTest Message: shutting down test

      STATUS:Failed.`main' threw exception: java.lang.RuntimeException: Test failed: Number of mismatches (112108) exceeds limit (54000) with tolerance=5


      java/awt/image/VolatileImage/BitmaskVolatileImage.java

      ----------System.out:(2/56)----------
           Metal: Supported, feature set macOS GPUFamily2 v1

      ----------System.err:(19/990)----------
      metalEnabled=1
      Metal support is present
      Exp:ff000000
      Actual:0
      java.lang.RuntimeException: Colors mismatch!
      at BitmaskVolatileImage.validate(BitmaskVolatileImage.java:89)
      at BitmaskVolatileImage.test(BitmaskVolatileImage.java:68)
      at BitmaskVolatileImage.main(BitmaskVolatileImage.java:59)
      at java.base/jdk.internal.reflect.NativeMethodAccessorImpl.invoke0(Native Method)
      at java.base/jdk.internal.reflect.NativeMethodAccessorImpl.invoke(NativeMethodAccessorImpl.java:64)
      at java.base/jdk.internal.reflect.DelegatingMethodAccessorImpl.invoke(DelegatingMethodAccessorImpl.java:43)
      at java.base/java.lang.reflect.Method.invoke(Method.java:564)
      at com.sun.javatest.regtest.agent.MainWrapper$MainThread.run(MainWrapper.java:127)
      at java.base/java.lang.Thread.run(Thread.java:832)

      JavaTest Message: Test threw exception: java.lang.RuntimeException: Colors mismatch!
      JavaTest Message: shutting down test

      STATUS:Failed.`main' threw exception: java.lang.RuntimeException: Colors mismatch!

        Attachments

          Activity

            People

            • Assignee:
              avu Alexey Ushakov
              Reporter:
              trebari Tejpal Rebari
            • Votes:
              0 Vote for this issue
              Watchers:
              2 Start watching this issue

              Dates

              • Created:
                Updated: